fit_car.id,fit_car.ts,fit_car.car,part.id,part.ts,part.description,part.part,part.price,part.mark,part.star,part.review_count,part.part_number,part.sub_name,part.fcp_euro_number,part.quality,part.made_in,part.mfg_numerbr
101,"2018-12-20 01:57:31","Volvo V70",1002,"2018-12-12 02:11:19",,"Volvo Brake Hose Kit - Corteco KIT-538633",$37.33,OEM,,,KIT-538633,,538633,OEM,,"19035819, 706402"
102,"2018-12-20 01:57:41","Volvo S60",1003,"2018-12-12 02:11:23",,"Volvo Brake Hose Kit - Corteco KIT-538635",$29.49,OEM,,,KIT-538635,,538635,OEM,,19026526
103,"2018-12-20 01:57:41","Volvo S80",1003,"2018-12-12 02:11:23",,"Volvo Brake Hose Kit - Corteco KIT-538635",$29.49,OEM,,,KIT-538635,,538635,OEM,,19026526
104,"2018-12-20 01:57:41","Volvo V70",1003,"2018-12-12 02:11:23",,"Volvo Brake Hose Kit - Corteco KIT-538635",$29.49,OEM,,,KIT-538635,,538635,OEM,,19026526
105,"2018-12-20 01:57:47","Volvo S60",1004,"2018-12-12 02:11:26",,"Volvo Brake Hose - Techna-Fit 30648980",$87.69,,5,3,VOL-1205,"S60, V70",181872,Performance,Unidentifiable,1205
106,"2018-12-20 01:57:47","Volvo V70",1004,"2018-12-12 02:11:26",,"Volvo Brake Hose - Techna-Fit 30648980",$87.69,,5,3,VOL-1205,"S60, V70",181872,Performance,Unidentifiable,1205
107,"2018-12-20 01:57:56","Volvo 850",1005,"2018-12-12 02:11:29","**Volvo Brake Line Bracket Front Right (850 C70 S70 V70) - Genuine Volvo 3546815** Whether its bent, broken, or missing, this is a replacement bracket responsible for housing the marriage between the front right brake hydraulic rubber hose and the brake hydraulic metal line.","Volvo Brake Hose Bracket - Genuine Volvo 3546815",$14.36,,,,VOL-3546815,"850, C70, S70, V70",425658,Genuine,,
108,"2018-12-20 01:57:56","Volvo C70",1005,"2018-12-12 02:11:29","**Volvo Brake Line Bracket Front Right (850 C70 S70 V70) - Genuine Volvo 3546815** Whether its bent, broken, or missing, this is a replacement bracket responsible for housing the marriage between the front right brake hydraulic rubber hose and the brake hydraulic metal line.","Volvo Brake Hose Bracket - Genuine Volvo 3546815",$14.36,,,,VOL-3546815,"850, C70, S70, V70",425658,Genuine,,
109,"2018-12-20 01:57:56","Volvo S70",1005,"2018-12-12 02:11:29","**Volvo Brake Line Bracket Front Right (850 C70 S70 V70) - Genuine Volvo 3546815** Whether its bent, broken, or missing, this is a replacement bracket responsible for housing the marriage between the front right brake hydraulic rubber hose and the brake hydraulic metal line.","Volvo Brake Hose Bracket - Genuine Volvo 3546815",$14.36,,,,VOL-3546815,"850, C70, S70, V70",425658,Genuine,,
110,"2018-12-20 01:57:56","Volvo V70",1005,"2018-12-12 02:11:29","**Volvo Brake Line Bracket Front Right (850 C70 S70 V70) - Genuine Volvo 3546815** Whether its bent, broken, or missing, this is a replacement bracket responsible for housing the marriage between the front right brake hydraulic rubber hose and the brake hydraulic metal line.","Volvo Brake Hose Bracket - Genuine Volvo 3546815",$14.36,,,,VOL-3546815,"850, C70, S70, V70",425658,Genuine,,
111,"2018-12-20 01:58:08","Volvo 850",1006,"2018-12-12 02:11:34","**Volvo Brake Line Bracket Front Left (850 C70 S70 V70) - Genuine Volvo 3546814** Whether its bent, broken, or missing, this is a replacement bracket responsible for housing the marriage between the front right brake hydraulic rubber hose and the brake hydraulic metal line.","Volvo Brake Hose Bracket - Genuine Volvo 3546814",$14.36,,,,VOL-3546814,"850, C70, S70, V70",425659,Genuine,,
112,"2018-12-20 01:58:08","Volvo C70",1006,"2018-12-12 02:11:34","**Volvo Brake Line Bracket Front Left (850 C70 S70 V70) - Genuine Volvo 3546814** Whether its bent, broken, or missing, this is a replacement bracket responsible for housing the marriage between the front right brake hydraulic rubber hose and the brake hydraulic metal line.","Volvo Brake Hose Bracket - Genuine Volvo 3546814",$14.36,,,,VOL-3546814,"850, C70, S70, V70",425659,Genuine,,
113,"2018-12-20 01:58:08","Volvo S70",1006,"2018-12-12 02:11:34","**Volvo Brake Line Bracket Front Left (850 C70 S70 V70) - Genuine Volvo 3546814** Whether its bent, broken, or missing, this is a replacement bracket responsible for housing the marriage between the front right brake hydraulic rubber hose and the brake hydraulic metal line.","Volvo Brake Hose Bracket - Genuine Volvo 3546814",$14.36,,,,VOL-3546814,"850, C70, S70, V70",425659,Genuine,,
114,"2018-12-20 01:58:08","Volvo V70",1006,"2018-12-12 02:11:34","**Volvo Brake Line Bracket Front Left (850 C70 S70 V70) - Genuine Volvo 3546814** Whether its bent, broken, or missing, this is a replacement bracket responsible for housing the marriage between the front right brake hydraulic rubber hose and the brake hydraulic metal line.","Volvo Brake Hose Bracket - Genuine Volvo 3546814",$14.36,,,,VOL-3546814,"850, C70, S70, V70",425659,Genuine,,
115,"2018-12-20 01:58:13","Volvo S60",1007,"2018-12-12 02:11:43",,"Volvo Brake Line Mounting Bracket - Genuine Volvo 30742601",$14.36,,,,VOL-30742601,"S60, S80, V70, XC90",214517,Genuine,,
116,"2018-12-20 01:58:13","Volvo S80",1007,"2018-12-12 02:11:43",,"Volvo Brake Line Mounting Bracket - Genuine Volvo 30742601",$14.36,,,,VOL-30742601,"S60, S80, V70, XC90",214517,Genuine,,
117,"2018-12-20 01:58:13","Volvo V70",1007,"2018-12-12 02:11:43",,"Volvo Brake Line Mounting Bracket - Genuine Volvo 30742601",$14.36,,,,VOL-30742601,"S60, S80, V70, XC90",214517,Genuine,,
118,"2018-12-20 01:58:13","Volvo XC90",1007,"2018-12-12 02:11:43",,"Volvo Brake Line Mounting Bracket - Genuine Volvo 30742601",$14.36,,,,VOL-30742601,"S60, S80, V70, XC90",214517,Genuine,,
119,"2018-12-20 01:58:15","Volvo S60",1008,"2018-12-12 02:11:51",,"Volvo Mounting Bracket - Genuine Volvo 30742602",$14.36,,,,VOL-30742602,"S60, S80",214518,Genuine,,
120,"2018-12-20 01:58:15","Volvo S80",1008,"2018-12-12 02:11:51",,"Volvo Mounting Bracket - Genuine Volvo 30742602",$14.36,,,,VOL-30742602,"S60, S80",214518,Genuine,,
121,"2018-12-20 01:58:15","Volvo V40",1008,"2018-12-12 02:11:51",,"Volvo Mounting Bracket - Genuine Volvo 30742602",$14.36,,,,VOL-30742602,"S60, S80",214518,Genuine,,
122,"2018-12-20 01:58:24","Volvo S80",1009,"2018-12-12 02:11:58",,"Volvo Brake Hydraulic Hose Bracket - Genuine Volvo 30793357",$6.46,,,,VOL-30793357,S80,230108,Genuine,,
123,"2018-12-20 01:58:24","Volvo XC70",1009,"2018-12-12 02:11:58",,"Volvo Brake Hydraulic Hose Bracket - Genuine Volvo 30793357",$6.46,,,,VOL-30793357,S80,230108,Genuine,,
124,"2018-12-20 01:58:24","Volvo V70",1009,"2018-12-12 02:11:58",,"Volvo Brake Hydraulic Hose Bracket - Genuine Volvo 30793357",$6.46,,,,VOL-30793357,S80,230108,Genuine,,
125,"2018-12-20 01:58:24","Volvo XC60",1009,"2018-12-12 02:11:58",,"Volvo Brake Hydraulic Hose Bracket - Genuine Volvo 30793357",$6.46,,,,VOL-30793357,S80,230108,Genuine,,
126,"2018-12-20 01:58:24","Volvo S60",1009,"2018-12-12 02:11:58",,"Volvo Brake Hydraulic Hose Bracket - Genuine Volvo 30793357",$6.46,,,,VOL-30793357,S80,230108,Genuine,,
127,"2018-12-20 01:58:24","Volvo V60",1009,"2018-12-12 02:11:58",,"Volvo Brake Hydraulic Hose Bracket - Genuine Volvo 30793357",$6.46,,,,VOL-30793357,S80,230108,Genuine,,
128,"2018-12-20 01:58:36","Volvo S80",1010,"2018-12-12 02:12:47",,"Volvo Brake Hydraulic Hose Bracket - Genuine Volvo 30793358",$6.46,,,,VOL-30793358,S80,230109,Genuine,,
129,"2018-12-20 01:58:36","Volvo XC70",1010,"2018-12-12 02:12:47",,"Volvo Brake Hydraulic Hose Bracket - Genuine Volvo 30793358",$6.46,,,,VOL-30793358,S80,230109,Genuine,,
130,"2018-12-20 01:58:36","Volvo V70",1010,"2018-12-12 02:12:47",,"Volvo Brake Hydraulic Hose Bracket - Genuine Volvo 30793358",$6.46,,,,VOL-30793358,S80,230109,Genuine,,
131,"2018-12-20 01:58:36","Volvo XC60",1010,"2018-12-12 02:12:47",,"Volvo Brake Hydraulic Hose Bracket - Genuine Volvo 30793358",$6.46,,,,VOL-30793358,S80,230109,Genuine,,
132,"2018-12-20 01:58:36","Volvo S60",1010,"2018-12-12 02:12:47",,"Volvo Brake Hydraulic Hose Bracket - Genuine Volvo 30793358",$6.46,,,,VOL-30793358,S80,230109,Genuine,,
133,"2018-12-20 01:58:36","Volvo V60",1010,"2018-12-12 02:12:47",,"Volvo Brake Hydraulic Hose Bracket - Genuine Volvo 30793358",$6.46,,,,VOL-30793358,S80,230109,Genuine,,
134,"2018-12-20 01:58:47","Volvo C70",1011,"2018-12-12 02:12:53","<desc><p>Brake hoses carry hydraulic brake fluid from your master brake cylinder to your brakes and can become brittle with age and leak making the car unsafe to drive. Be sure to inspect your brake lines with each brake service and replace brake lines that show age or are leaking. It is also the perfect opportunity to flush you entire brake system with new brake line hydraulic fluid.</p><p>The original parts used by Volvo to build your car are available as replacement parts under the ""Genuine Volvo"" brand. Manufactured under the direction of Volvo, expect excellent quality and a premium price since these parts are exclusively available through the Volvo Dealership network. You may not realize this, but the parts that make up your Volvo are not necessarily manufactured by Volvo. No cause for concern, as Volvo designs the part, hires a manufacturer and ensures its quality to you, including a 1 year warranty. In fact, many of these manufacturers have been making parts for Volvo for decades and are experts in their own right. In our industry these manufacturers are called OEM (Original Equipment Manufacturers) or OES (Original Equipment Suppliers), and are often brands you recognize including Bosch, KYB, NGK and Sachs. Don't be surprised to open that Genuine Volvo parts box and find a NGK branded part inside. If you are looking to buy Genuine Volvo Parts online then you've come to the right place. FCP Euro offers both types of product - Genuine Volvo and OEM/OES - from brands we trust to use on our own cars. If you have any questions on what options are available to you, just give us a call, we are happy to help.</p><p>FCP Euro is an online retailer of Genuine & OEM replacement Volvo parts. Our online catalog offers an extensive range of Volvo parts for all makes and model, as well as replacement parts for all European vehicles. Since 1986 we have been committed to providing our customers only the highest quality Genuine & OEM replacement parts backed with a price match guarantee, free shipping, lifetime warranty and fitment guarantees on every part we sell. With our hassle free 365 day return policy and free tech support you can trust FCP for all of your replacement part needs.</p></desc>","Volvo Brake Line - Genuine Volvo 3546365",$40.21,,5,1,VOL-3546365,"C70, S70, V70",227054,Genuine,,
135,"2018-12-20 01:58:47","Volvo S70",1011,"2018-12-12 02:12:53","<desc><p>Brake hoses carry hydraulic brake fluid from your master brake cylinder to your brakes and can become brittle with age and leak making the car unsafe to drive. Be sure to inspect your brake lines with each brake service and replace brake lines that show age or are leaking. It is also the perfect opportunity to flush you entire brake system with new brake line hydraulic fluid.</p><p>The original parts used by Volvo to build your car are available as replacement parts under the ""Genuine Volvo"" brand. Manufactured under the direction of Volvo, expect excellent quality and a premium price since these parts are exclusively available through the Volvo Dealership network. You may not realize this, but the parts that make up your Volvo are not necessarily manufactured by Volvo. No cause for concern, as Volvo designs the part, hires a manufacturer and ensures its quality to you, including a 1 year warranty. In fact, many of these manufacturers have been making parts for Volvo for decades and are experts in their own right. In our industry these manufacturers are called OEM (Original Equipment Manufacturers) or OES (Original Equipment Suppliers), and are often brands you recognize including Bosch, KYB, NGK and Sachs. Don't be surprised to open that Genuine Volvo parts box and find a NGK branded part inside. If you are looking to buy Genuine Volvo Parts online then you've come to the right place. FCP Euro offers both types of product - Genuine Volvo and OEM/OES - from brands we trust to use on our own cars. If you have any questions on what options are available to you, just give us a call, we are happy to help.</p><p>FCP Euro is an online retailer of Genuine & OEM replacement Volvo parts. Our online catalog offers an extensive range of Volvo parts for all makes and model, as well as replacement parts for all European vehicles. Since 1986 we have been committed to providing our customers only the highest quality Genuine & OEM replacement parts backed with a price match guarantee, free shipping, lifetime warranty and fitment guarantees on every part we sell. With our hassle free 365 day return policy and free tech support you can trust FCP for all of your replacement part needs.</p></desc>","Volvo Brake Line - Genuine Volvo 3546365",$40.21,,5,1,VOL-3546365,"C70, S70, V70",227054,Genuine,,
136,"2018-12-20 01:58:48","Volvo V70",1011,"2018-12-12 02:12:53","<desc><p>Brake hoses carry hydraulic brake fluid from your master brake cylinder to your brakes and can become brittle with age and leak making the car unsafe to drive. Be sure to inspect your brake lines with each brake service and replace brake lines that show age or are leaking. It is also the perfect opportunity to flush you entire brake system with new brake line hydraulic fluid.</p><p>The original parts used by Volvo to build your car are available as replacement parts under the ""Genuine Volvo"" brand. Manufactured under the direction of Volvo, expect excellent quality and a premium price since these parts are exclusively available through the Volvo Dealership network. You may not realize this, but the parts that make up your Volvo are not necessarily manufactured by Volvo. No cause for concern, as Volvo designs the part, hires a manufacturer and ensures its quality to you, including a 1 year warranty. In fact, many of these manufacturers have been making parts for Volvo for decades and are experts in their own right. In our industry these manufacturers are called OEM (Original Equipment Manufacturers) or OES (Original Equipment Suppliers), and are often brands you recognize including Bosch, KYB, NGK and Sachs. Don't be surprised to open that Genuine Volvo parts box and find a NGK branded part inside. If you are looking to buy Genuine Volvo Parts online then you've come to the right place. FCP Euro offers both types of product - Genuine Volvo and OEM/OES - from brands we trust to use on our own cars. If you have any questions on what options are available to you, just give us a call, we are happy to help.</p><p>FCP Euro is an online retailer of Genuine & OEM replacement Volvo parts. Our online catalog offers an extensive range of Volvo parts for all makes and model, as well as replacement parts for all European vehicles. Since 1986 we have been committed to providing our customers only the highest quality Genuine & OEM replacement parts backed with a price match guarantee, free shipping, lifetime warranty and fitment guarantees on every part we sell. With our hassle free 365 day return policy and free tech support you can trust FCP for all of your replacement part needs.</p></desc>","Volvo Brake Line - Genuine Volvo 3546365",$40.21,,5,1,VOL-3546365,"C70, S70, V70",227054,Genuine,,
137,"2018-12-20 01:58:53","Volvo S40",1012,"2018-12-12 02:13:31",,"Volvo Brake Hose - Genuine Volvo 30681724",$34.65,,,,VOL-30681724,"C70, S40, V50",229205,Genuine,,
138,"2018-12-20 01:58:53","Volvo V50",1012,"2018-12-12 02:13:31",,"Volvo Brake Hose - Genuine Volvo 30681724",$34.65,,,,VOL-30681724,"C70, S40, V50",229205,Genuine,,
139,"2018-12-20 01:58:53","Volvo C70",1012,"2018-12-12 02:13:31",,"Volvo Brake Hose - Genuine Volvo 30681724",$34.65,,,,VOL-30681724,"C70, S40, V50",229205,Genuine,,
140,"2018-12-20 01:58:57","Volvo S40",1013,"2018-12-12 02:13:34",,"Volvo Brake Hydraulic Line - Genuine Volvo 30681727",$30.51,,,,VOL-30681727,"S40, V50",229208,Genuine,,
141,"2018-12-20 01:58:57","Volvo V50",1013,"2018-12-12 02:13:34",,"Volvo Brake Hydraulic Line - Genuine Volvo 30681727",$30.51,,,,VOL-30681727,"S40, V50",229208,Genuine,,
142,"2018-12-20 01:59:07","Volvo S40",1014,"2018-12-12 02:13:36","<desc><p>Brake hoses carry hydraulic brake fluid from your master brake cylinder to your brakes and can become brittle with age and leak making the car unsafe to drive. Be sure to inspect your brake lines with each brake service and replace brake lines that show age or are leaking. It is also the perfect opportunity to flush you entire brake system with new brake line hydraulic fluid.</p><p>The original parts used by Volvo to build your car are available as replacement parts under the “Genuine Volvo” brand. Manufactured under the direction of Volvo, expect excellent quality and a premium price since these parts are exclusively available through the Volvo Dealership network. You may not realize this, but the parts that make up your Volvo are not necessarily manufactured by Volvo. No cause for concern, as Volvo designs the part, hires a manufacturer and ensures its quality to you, including a lifetime warranty. In fact, many of these manufacturers have been making parts for Volvo for decades and are experts in their own right. In our industry these manufacturers are called OEM (Original Equipment Manufacturers) or OES (Original Equipment Suppliers), and are often brands you recognize including Bosch, KYB, NGK and Sachs. Don’t be surprised to open that Genuine Volvo parts box and find a NGK branded part inside. If you are looking to buy Genuine Volvo Parts online then you’ve come to the right place. FCP Euro offers both types of product – Genuine Volvo and OEM/OES - from brands we trust to use on our own cars. If you have any questions on what options are available to you, just give us a call, we are happy to help.</p><p>FCP Euro is an online retailer of Genuine & OEM replacement Volvo parts. Our online catalog offers an extensive range of Volvo parts for all makes and models, as well as replacement parts for all European vehicles. Since 1986 we have been committed to providing our customers only the highest quality Genuine & OEM replacement parts backed with a price match guarantee, free shipping, lifetime warranty and fitment guarantees on every part we sell. With our hassle free 365 day return policy and free tech support you can trust FCP for all of your Volvo replacement part needs.</p></desc>","Volvo Brake Hydraulic Hose - Genuine Volvo 31329115",$52.73,,,,VOL-31329115,"S40, V40",231266,Genuine,,
143,"2018-12-20 01:59:07","Volvo V40",1014,"2018-12-12 02:13:36","<desc><p>Brake hoses carry hydraulic brake fluid from your master brake cylinder to your brakes and can become brittle with age and leak making the car unsafe to drive. Be sure to inspect your brake lines with each brake service and replace brake lines that show age or are leaking. It is also the perfect opportunity to flush you entire brake system with new brake line hydraulic fluid.</p><p>The original parts used by Volvo to build your car are available as replacement parts under the “Genuine Volvo” brand. Manufactured under the direction of Volvo, expect excellent quality and a premium price since these parts are exclusively available through the Volvo Dealership network. You may not realize this, but the parts that make up your Volvo are not necessarily manufactured by Volvo. No cause for concern, as Volvo designs the part, hires a manufacturer and ensures its quality to you, including a lifetime warranty. In fact, many of these manufacturers have been making parts for Volvo for decades and are experts in their own right. In our industry these manufacturers are called OEM (Original Equipment Manufacturers) or OES (Original Equipment Suppliers), and are often brands you recognize including Bosch, KYB, NGK and Sachs. Don’t be surprised to open that Genuine Volvo parts box and find a NGK branded part inside. If you are looking to buy Genuine Volvo Parts online then you’ve come to the right place. FCP Euro offers both types of product – Genuine Volvo and OEM/OES - from brands we trust to use on our own cars. If you have any questions on what options are available to you, just give us a call, we are happy to help.</p><p>FCP Euro is an online retailer of Genuine & OEM replacement Volvo parts. Our online catalog offers an extensive range of Volvo parts for all makes and models, as well as replacement parts for all European vehicles. Since 1986 we have been committed to providing our customers only the highest quality Genuine & OEM replacement parts backed with a price match guarantee, free shipping, lifetime warranty and fitment guarantees on every part we sell. With our hassle free 365 day return policy and free tech support you can trust FCP for all of your Volvo replacement part needs.</p></desc>","Volvo Brake Hydraulic Hose - Genuine Volvo 31329115",$52.73,,,,VOL-31329115,"S40, V40",231266,Genuine,,
144,"2018-12-20 01:59:14","Volvo S40",1015,"2018-12-12 02:13:50",,"Volvo Brake Hydraulic Line - Genuine Volvo 31274645",$46.77,,,,VOL-31274645,"C30, C70, S40, V50",230834,Genuine,,
145,"2018-12-20 01:59:14","Volvo V50",1015,"2018-12-12 02:13:50",,"Volvo Brake Hydraulic Line - Genuine Volvo 31274645",$46.77,,,,VOL-31274645,"C30, C70, S40, V50",230834,Genuine,,
146,"2018-12-20 01:59:14","Volvo C70",1015,"2018-12-12 02:13:50",,"Volvo Brake Hydraulic Line - Genuine Volvo 31274645",$46.77,,,,VOL-31274645,"C30, C70, S40, V50",230834,Genuine,,
147,"2018-12-20 01:59:14","Volvo C30",1015,"2018-12-12 02:13:50",,"Volvo Brake Hydraulic Line - Genuine Volvo 31274645",$46.77,,,,VOL-31274645,"C30, C70, S40, V50",230834,Genuine,,
148,"2018-12-20 01:59:22","Volvo S70",1016,"2018-12-12 02:14:02",,"Volvo Brake Hydraulic Line - Genuine Volvo 9438278",$40.21,,,,VOL-9438278,"S70, V70",228344,Genuine,,
149,"2018-12-20 01:59:22","Volvo V70",1016,"2018-12-12 02:14:02",,"Volvo Brake Hydraulic Line - Genuine Volvo 9438278",$40.21,,,,VOL-9438278,"S70, V70",228344,Genuine,,
150,"2018-12-20 01:59:34","Volvo S40",1017,"2018-12-12 02:14:07",,"Volvo Brake Hydraulic Line - Genuine Volvo 31274648",$35.82,,,,VOL-31274648,"C30, C70, S40, V50",230835,Genuine,,
151,"2018-12-20 01:59:34","Volvo V50",1017,"2018-12-12 02:14:07",,"Volvo Brake Hydraulic Line - Genuine Volvo 31274648",$35.82,,,,VOL-31274648,"C30, C70, S40, V50",230835,Genuine,,
152,"2018-12-20 01:59:34","Volvo C70",1017,"2018-12-12 02:14:07",,"Volvo Brake Hydraulic Line - Genuine Volvo 31274648",$35.82,,,,VOL-31274648,"C30, C70, S40, V50",230835,Genuine,,
153,"2018-12-20 01:59:34","Volvo C30",1017,"2018-12-12 02:14:07",,"Volvo Brake Hydraulic Line - Genuine Volvo 31274648",$35.82,,,,VOL-31274648,"C30, C70, S40, V50",230835,Genuine,,
154,"2018-12-20 01:59:44","Volvo C70",1018,"2018-12-12 02:14:12",,"Volvo Brake Hydraulic Line - Genuine Volvo 8618026",$29.24,,,,VOL-8618026,C70,227519,Genuine,,
155,"2018-12-20 01:59:56","Volvo S40",1019,"2018-12-12 02:14:22",,"Volvo Brake Hydraulic Line - Genuine Volvo 30681923",$20.46,,,,VOL-30681923,"C30, C70, S40",229223,Genuine,,
156,"2018-12-20 01:59:56","Volvo C30",1019,"2018-12-12 02:14:22",,"Volvo Brake Hydraulic Line - Genuine Volvo 30681923",$20.46,,,,VOL-30681923,"C30, C70, S40",229223,Genuine,,
157,"2018-12-20 01:59:56","Volvo C70",1019,"2018-12-12 02:14:22",,"Volvo Brake Hydraulic Line - Genuine Volvo 30681923",$20.46,,,,VOL-30681923,"C30, C70, S40",229223,Genuine,,
158,"2018-12-20 02:00:04","Volvo S40",1020,"2018-12-12 02:14:31",,"Volvo Brake Hydraulic Line - Genuine Volvo 30681925",$20.46,,,,VOL-30681925,"C70, S40, V50",229224,Genuine,,
159,"2018-12-20 02:00:04","Volvo V50",1020,"2018-12-12 02:14:31",,"Volvo Brake Hydraulic Line - Genuine Volvo 30681925",$20.46,,,,VOL-30681925,"C70, S40, V50",229224,Genuine,,
160,"2018-12-20 02:00:04","Volvo C70",1020,"2018-12-12 02:14:31",,"Volvo Brake Hydraulic Line - Genuine Volvo 30681925",$20.46,,,,VOL-30681925,"C70, S40, V50",229224,Genuine,,