part_image.id,part_image.ts,part_image.source_content_type,part_image.hash_file_content,part_image.size,part_image.path,part_image.title,part_image.access,image_slug.id,image_slug.ts,part.id,part.ts,part.description,part.part,part.price,part.mark,part.star,part.review_count,part.part_number,part.sub_name,part.fcp_euro_number,part.quality,part.made_in,part.mfg_numerbr
102,"2018-12-19 22:13:59",image/jpeg,b7dfb13c52c5eecaec85c335419202ba35888da2,88611,/b7/df/b1/3c/b7dfb13c52c5eecaec85c335419202ba35888da2.jpg,,https://songer.datasn.com/data/api/v1/u_e49e7f0fcb85c5451b03/parts_and_assemblies_of_car_for_6_brands/by_table/part_image_access/b7/df/b1/3c/b7dfb13c52c5eecaec85c335419202ba35888da2.jpg,50053,"2018-12-14 22:19:57",23862,"2018-12-14 22:19:57","<desc pt>Part number 33322227968 is a brand new, unused Genuine BMW part. 33322227968 is part of your BMW's rear suspension. Items like wishbones, trailing arms, and bushings all play a role in your BMW's unique handling and performance characteristics.</desc pt><br><br><desc bmw>Genuine BMW parts are typically available at BMW dealerships. These parts are used to service BMW’s at your local BMW dealer and are the same parts that you can order and purchase at your local BMW dealer parts department. Genuine BMW parts are manufactured for BMW by some of the leading OE suppliers such as Bosch, VDO, ATE, and Hella. You can be assured that a part is Genuine based on a BMW stamping near the part number on the part itself.</desc bmw><br><br><desc fcp>FCP Euro is a leading online retailer of Original Equipment (OEM) and Genuine replacement parts for European cars. Starting as Volvo specialists in 1986, FCP Euro now offers coverage for all European makes including Volvo, BMW, Mercedes, Audi, Saab and VW.</desc fcp><br><br><desc vp>FCP Euro is committed to providing exceptional quality and service for life which is why they offer a lifetime warranty on all products they sell, free shipping over $49, unlimited hassle free returns, and free technical support to assist with all of your repair and replacement part needs.</desc vp>","BMW Trailing Arm Right (Z3) - Genuine BMW 33322227968",,,,,BMW-33322227968,Z3,261486,Genuine,,
103,"2018-12-19 22:14:20",image/jpeg,6556404c994f4c70f4aa78da98adf3f9f5e1fd17,118719,/65/56/40/4c/6556404c994f4c70f4aa78da98adf3f9f5e1fd17.jpg,,https://songer.datasn.com/data/api/v1/u_e49e7f0fcb85c5451b03/parts_and_assemblies_of_car_for_6_brands/by_table/part_image_access/65/56/40/4c/6556404c994f4c70f4aa78da98adf3f9f5e1fd17.jpg,50054,"2018-12-14 22:19:57",23862,"2018-12-14 22:19:57","<desc pt>Part number 33322227968 is a brand new, unused Genuine BMW part. 33322227968 is part of your BMW's rear suspension. Items like wishbones, trailing arms, and bushings all play a role in your BMW's unique handling and performance characteristics.</desc pt><br><br><desc bmw>Genuine BMW parts are typically available at BMW dealerships. These parts are used to service BMW’s at your local BMW dealer and are the same parts that you can order and purchase at your local BMW dealer parts department. Genuine BMW parts are manufactured for BMW by some of the leading OE suppliers such as Bosch, VDO, ATE, and Hella. You can be assured that a part is Genuine based on a BMW stamping near the part number on the part itself.</desc bmw><br><br><desc fcp>FCP Euro is a leading online retailer of Original Equipment (OEM) and Genuine replacement parts for European cars. Starting as Volvo specialists in 1986, FCP Euro now offers coverage for all European makes including Volvo, BMW, Mercedes, Audi, Saab and VW.</desc fcp><br><br><desc vp>FCP Euro is committed to providing exceptional quality and service for life which is why they offer a lifetime warranty on all products they sell, free shipping over $49, unlimited hassle free returns, and free technical support to assist with all of your repair and replacement part needs.</desc vp>","BMW Trailing Arm Right (Z3) - Genuine BMW 33322227968",,,,,BMW-33322227968,Z3,261486,Genuine,,
104,"2018-12-19 22:14:31",image/jpeg,322caf82a80c410f00c2d9c05996332a44d12ddb,47904,/32/2c/af/82/322caf82a80c410f00c2d9c05996332a44d12ddb.jpg,,https://songer.datasn.com/data/api/v1/u_e49e7f0fcb85c5451b03/parts_and_assemblies_of_car_for_6_brands/by_table/part_image_access/32/2c/af/82/322caf82a80c410f00c2d9c05996332a44d12ddb.jpg,50055,"2018-12-14 22:20:18",23865,"2018-12-14 22:20:18","**Mounts the trailing arm to the body, a common failure item on high mileage vehicles** Your BMW's rear suspension is a trailing arm style design. The trailing arm is an integral part of the rear suspension and it acts as a mounting point for other control arms, the axles, the brakes, and the wheel hubs. The trailing arm is mounted to the chassis by a bushing which bolts directly to a bracket. A failed trailing arm bushing can cause excessive play within the suspension. Play within the trailing arm mounts will affect alignment which will lead to poor road handling. Badly worn trailing arm bushings can even cause knocking sounds from the rear suspension. We recommend replacing trailing arm bushings in matched pairs. To further improve the lifespan of your trailing arm bushings we also suggest ordering a specially designed reinforcement spacer set, part number [093031010](/products/bmw-trailing-arm-bushing-reinforcement-spacer-set-093031010). This spacer set reduces the amount of deflection in the trailing arm bushing and will help prevent premature failure.","BMW Trailing Arm Bushing (E36 E46 E85 E86) - Lemforder 33326770817",$14.29,OE,5,3,LEM-3503801,"M3, Z4",51696,OE,Poland,
105,"2018-12-19 22:14:47",image/jpeg,0445aa761e15126bdfe34b9b2f4f4b9825116eec,8573,/04/45/aa/76/0445aa761e15126bdfe34b9b2f4f4b9825116eec.jpg,,https://songer.datasn.com/data/api/v1/u_e49e7f0fcb85c5451b03/parts_and_assemblies_of_car_for_6_brands/by_table/part_image_access/04/45/aa/76/0445aa761e15126bdfe34b9b2f4f4b9825116eec.jpg,50056,"2018-12-14 22:20:31",23866,"2018-12-14 22:20:31",,"BMW Suspension Trailing Arm Bushing (740i 740iL 750iL M5) - Lemforder 33321135808",$73.29,OEM,,,LEM-1330901,"740i, 740iL, 750iL, M5",421095,OEM,Germany,
106,"2018-12-19 22:14:50",image/jpeg,159116495f64bd23957c4524aff587525088c84d,47255,/15/91/16/49/159116495f64bd23957c4524aff587525088c84d.jpg,,https://songer.datasn.com/data/api/v1/u_e49e7f0fcb85c5451b03/parts_and_assemblies_of_car_for_6_brands/by_table/part_image_access/15/91/16/49/159116495f64bd23957c4524aff587525088c84d.jpg,50057,"2018-12-14 22:20:31",23866,"2018-12-14 22:20:31",,"BMW Suspension Trailing Arm Bushing (740i 740iL 750iL M5) - Lemforder 33321135808",$73.29,OEM,,,LEM-1330901,"740i, 740iL, 750iL, M5",421095,OEM,Germany,
107,"2018-12-19 22:15:35",image/png,9cdd750aebb605ee64581902834266e26b46c1c4,160174,/9c/dd/75/0a/9cdd750aebb605ee64581902834266e26b46c1c4.jpg,,https://songer.datasn.com/data/api/v1/u_e49e7f0fcb85c5451b03/parts_and_assemblies_of_car_for_6_brands/by_table/part_image_access/9c/dd/75/0a/9cdd750aebb605ee64581902834266e26b46c1c4.jpg,49,"2018-12-11 23:22:53",23,"2018-12-11 23:22:53",,"Volvo A/C Compressor Clutch (240 244 245 740) - Air Products 1365539",$138.49,,,,AIR-1365539,"240, 244, 245, 740, 745, 760, 780, 940",509650,Genuine,,
108,"2018-12-19 22:15:41",image/png,e0d28abb4e4c190336a705791a76f31d43347bb3,169743,/e0/d2/8a/bb/e0d28abb4e4c190336a705791a76f31d43347bb3.jpg,,https://songer.datasn.com/data/api/v1/u_e49e7f0fcb85c5451b03/parts_and_assemblies_of_car_for_6_brands/by_table/part_image_access/e0/d2/8a/bb/e0d28abb4e4c190336a705791a76f31d43347bb3.jpg,50,"2018-12-11 23:22:53",23,"2018-12-11 23:22:53",,"Volvo A/C Compressor Clutch (240 244 245 740) - Air Products 1365539",$138.49,,,,AIR-1365539,"240, 244, 245, 740, 745, 760, 780, 940",509650,Genuine,,
109,"2018-12-19 22:16:36",image/jpeg,7883237f0341171b6d3b1080f57edcde584bc8c7,101576,/78/83/23/7f/7883237f0341171b6d3b1080f57edcde584bc8c7.jpg,,https://songer.datasn.com/data/api/v1/u_e49e7f0fcb85c5451b03/parts_and_assemblies_of_car_for_6_brands/by_table/part_image_access/78/83/23/7f/7883237f0341171b6d3b1080f57edcde584bc8c7.jpg,50058,"2018-12-14 22:20:41",23867,"2018-12-14 22:20:41","Help to ensure the proper movement of your BMW trailing arms with these TRW trailing arm bushings. FCP Euro is devoted to bringing you these and a growing selection of BMW parts that contribute to the continued functionality, safety, and performance of your vehicle.","BMW Trailing Arm Bushing (740i 740il 750il M5) - TRW 33321135808",$50.19,OEM,,,TRW-JBU390,"740i, 740iL, 750iL, M5",66030,OEM,Germany,
110,"2018-12-19 22:16:46",image/jpeg,d1531abd65d91823b9b513cb8856f9b524249564,31119,/d1/53/1a/bd/d1531abd65d91823b9b513cb8856f9b524249564.jpg,,https://songer.datasn.com/data/api/v1/u_e49e7f0fcb85c5451b03/parts_and_assemblies_of_car_for_6_brands/by_table/part_image_access/d1/53/1a/bd/d1531abd65d91823b9b513cb8856f9b524249564.jpg,50059,"2018-12-14 22:20:43",77360,"2018-12-14 22:20:43",,"Porsche Hood Seal - Oem Supplier 6445119010621.99",$21.99,OEM,,,OEM-64451190106,"356A, 356B, 356C, 356SC",507891,OEM,,
111,"2018-12-19 22:16:52",image/jpeg,77dc15fcecc9291ec1378117a3f44e2b106a4d45,34354,/77/dc/15/fc/77dc15fcecc9291ec1378117a3f44e2b106a4d45.jpg,,https://songer.datasn.com/data/api/v1/u_e49e7f0fcb85c5451b03/parts_and_assemblies_of_car_for_6_brands/by_table/part_image_access/77/dc/15/fc/77dc15fcecc9291ec1378117a3f44e2b106a4d45.jpg,50060,"2018-12-14 22:20:45",23868,"2018-12-14 22:20:45","**Located in the subframe as well as the wheel carrier, acts as the mounting point for the trailing arm** This bushing works as a connecting point for your BMW's rear trailing arm. As your vehicle ages these rubber components will begin to tear and eventually fail. If your rear end feels loose and seems to ""wander"" then it's very likely you need to replace your trailing arm bushings. We highly recommend replacing all 4 at the same time for best performance. **Note:** 2 per side (4 per car), priced and sold individually.","BMW Trailing Arm Bushing - Lemforder 33326763092",$12.29,OEM,,,LEM-3058201,"1 Series M, 128i, 135i, 135is, 325i, 325xi, 328i, & more",120402,OEM,Poland,"30582 01"
112,"2018-12-19 22:16:57",image/jpeg,43a829394aeda821c8b4339e08759bfd2230ba66,105760,/43/a8/29/39/43a829394aeda821c8b4339e08759bfd2230ba66.jpg,,https://songer.datasn.com/data/api/v1/u_e49e7f0fcb85c5451b03/parts_and_assemblies_of_car_for_6_brands/by_table/part_image_access/43/a8/29/39/43a829394aeda821c8b4339e08759bfd2230ba66.jpg,51,"2018-12-11 23:23:00",24,"2018-12-11 23:23:00","<desc><p>In most cars the A/C compressor is not only used for cooling in the summer, but also used to defrost the windshield in winter. While some may be able to live without A/C, it can be very difficult to see in winter without a functioning defroster. The A/C system is one of the more complicated systems in the car, requiring special tools and knowledge, thus many DIY’ers will go the DIFM route (do it for me). Many pro’s will install our parts, but we advise that you check with them first. Consider replacing the A/C drier at the same time. The drier is designed to keep moisture out of the system and has a set “capacity” to remove that moisture. If you are investing in a new compressor, consider a new drier as well so as to be sure system moisture does not result in a premature failure of your new compressor. Another consideration is compressor oil. Some compressors come with oil in them already, but never assume the quantity of oil included is correct for your application, because some compressors are suitable for multiple applications (and some come with just enough oil in them to prevent corrosion during shipping). ALWAYS double check and refer to your repair manual for the proper quantity. We offer two compressor oils for your consideration, one with a UV dye to help locate leaks. With UV Dye - SKU number 351214201 is from Behr and is a PAO Synthetic Oil with UV Dye. As a result it will not absorb moisture and should you get any leaks they will be easy to locate with the dye. Without UV Dye - SKU number 351214031 is also from Behr, also a PAO Synthetic oil, but does not have the UV Dye, thus it is less expensive. </p><p>FCP Euro is an online retailer of Genuine & OEM replacement Volvo parts. Our online catalog offers an extensive range of Volvo parts for all makes and models, as well as replacement parts for all European vehicles. Since 1986 we have been committed to providing our customers only the highest quality Genuine & OEM replacement parts backed with a price match guarantee, free shipping, lifetime warranty and fitment guarantees on every part we sell. With our hassle free 365 day return policy and free tech support you can trust FCP for all of your Volvo replacement part needs.</p></desc>","Volvo A/C Compressor Clutch (240 242 244 245 760) 1259281",$130.09,,,,1259281,"242, 244, 245, 760",1450,Genuine,China,
113,"2018-12-19 22:16:58",image/jpeg,611eb0b877ed5e6e64f512cf48724049d89e97ba,33445,/61/1e/b0/b8/611eb0b877ed5e6e64f512cf48724049d89e97ba.jpg,,https://songer.datasn.com/data/api/v1/u_e49e7f0fcb85c5451b03/parts_and_assemblies_of_car_for_6_brands/by_table/part_image_access/61/1e/b0/b8/611eb0b877ed5e6e64f512cf48724049d89e97ba.jpg,50061,"2018-12-14 22:20:49",77361,"2018-12-14 22:20:49","<desc><p>Using new, quality seals are a relatively cheap investment knowing the significant investment you make in the work done on your car. Do the job once with quality materials for a leak free result.</p><p>At FCP, ""OEM Supplier"", ""OEM"" and ""Original Equipment Supplier"" all mean the same thing. OEM Supplier means it is the same company that made the parts for your car when it was built, and it is also the same company that makes the replacement parts available from your local car dealer as ""Genuine"", just expect you will pay less at FCP.</p><p>FCP Euro is an online retailer of Genuine & OEM replacement Porsche parts. Our online catalog offers an extensive range of Porsche parts for all makes and models, as well as replacement parts for all European vehicles. Since 1986 we have been committed to providing our customers only the highest quality Genuine & OEM replacement parts backed with a price match guarantee, free shipping, lifetime warranty and fitment guarantees on every part we sell. With our hassle free 365 day return policy and free tech support you can trust FCP for all of your Porsche replacement part needs.</p></desc>","Porsche Compartment Seal (911) - OEM Supplier 91150411302",$20.49,OEM,,,91150411302,911,141893,OEM,,
114,"2018-12-19 22:17:06",image/jpeg,a49a6373a13e9efe2c48e9efb1f0a51df9369071,57921,/a4/9a/63/73/a49a6373a13e9efe2c48e9efb1f0a51df9369071.jpg,,https://songer.datasn.com/data/api/v1/u_e49e7f0fcb85c5451b03/parts_and_assemblies_of_car_for_6_brands/by_table/part_image_access/a4/9a/63/73/a49a6373a13e9efe2c48e9efb1f0a51df9369071.jpg,50062,"2018-12-14 22:21:01",23869,"2018-12-14 22:21:01","**Located in the rear lower section portion of the trailing arm, acts as a mounting point for the rear lower control arm** This bushing acts as a mounting point for the rear lower control arm. With high mileage this bushing is known to fail causing alignment issues as well as knocking sounds from the rear. We recommend replacing this bushing in pairs.","BMW Trailing Arm Bushing Rear Lower Outer (E36 E46) - Lemforder 33326771828",$11.59,OEM,5,2,LEM-3071301,"318i, 318is, 323Ci, 323i, 323is, 325Ci, 325i, & more",66975,OEM,Germany,
115,"2018-12-19 22:17:09",image/jpeg,637aade65fcce9c8be728346069dd27f2f0bb24e,90594,/63/7a/ad/e6/637aade65fcce9c8be728346069dd27f2f0bb24e.jpg,,https://songer.datasn.com/data/api/v1/u_e49e7f0fcb85c5451b03/parts_and_assemblies_of_car_for_6_brands/by_table/part_image_access/63/7a/ad/e6/637aade65fcce9c8be728346069dd27f2f0bb24e.jpg,52,"2018-12-11 23:23:00",50021,"2018-12-11 23:23:00","**Identical switch supplied by Porsche, per Porsche it may be required to modify the switch/console housing to accommodate the new design**<br><br><desc pt>Part number: 91161312101 is a new, unused OEM Supplier a/c evaporator temperature switch. </desc pt><br><br><desc brand>At FCP, “OEM Supplier”, “OEM” and “Original Equipment Supplier” all mean the same thing. OEM Supplier means it is the same company that made the parts for your car when it was built, and it is also the same company that makes the replacement parts available from your local car dealer as “Genuine”, just expect you will pay less at FCP.</desc brand><br><br><desc fcp>FCP Euro is an online retailer specializing in replacement parts for European cars including Volvo, BMW, Saab, Audi, VW and Mercedes Benz. Since 1986 FCP has been focused on servicing it’s customer, providing the highest quality replacement parts at affordable prices, and making sure that it’s catalog is accurate to ensure that their replacement parts fit and perform exactly as original equipment.</desc fcp><br><br><desc vp>FCP Euro is committed to providing exceptional quality and service for life which is why they offer a lifetime warranty on all products they sell, free shipping over $49, unlimited hassle free returns, and free technical support to assist with all of your repair and replacement part needs.</desc vp>","Porsche A/C Temperature Switch - OEM Supplier 91161312101",$57.39,OEM,,,91161312101,"911, 930",34305,OEM,,
116,"2018-12-19 22:17:13",image/jpeg,b420d87d91afedca82d607dc50c23d88687ab428,50535,/b4/20/d8/7d/b420d87d91afedca82d607dc50c23d88687ab428.jpg,,https://songer.datasn.com/data/api/v1/u_e49e7f0fcb85c5451b03/parts_and_assemblies_of_car_for_6_brands/by_table/part_image_access/b4/20/d8/7d/b420d87d91afedca82d607dc50c23d88687ab428.jpg,50063,"2018-12-14 22:21:02",77362,"2018-12-14 22:21:02","<desc><p>Using new, quality seals are a relatively cheap investment knowing the significant investment you make in the work done on your car. Do the job once with quality materials for a leak free result.</p><p>At FCP, ""OEM Supplier"", ""OEM"" and ""Original Equipment Supplier"" all mean the same thing. OEM Supplier means it is the same company that made the parts for your car when it was built, and it is also the same company that makes the replacement parts available from your local car dealer as ""Genuine"", just expect you will pay less at FCP.</p><p>FCP Euro is an online retailer of Genuine & OEM replacement Porsche parts. Our online catalog offers an extensive range of Porsche parts for all makes and models, as well as replacement parts for all European vehicles. Since 1986 we have been committed to providing our customers only the highest quality Genuine & OEM replacement parts backed with a price match guarantee, free shipping, lifetime warranty and fitment guarantees on every part we sell. With our hassle free 365 day return policy and free tech support you can trust FCP for all of your Porsche replacement part needs.</p></desc>","Porsche Hood Seal (912 911) - OEM Supplier 90151290100",$17.69,OEM,,,90151290100,"911, 912",141872,OEM,,
117,"2018-12-19 22:17:18",image/jpeg,91c4bc82d73b7fa2a437816bcf240252482faf21,25355,/91/c4/bc/82/91c4bc82d73b7fa2a437816bcf240252482faf21.jpg,,https://songer.datasn.com/data/api/v1/u_e49e7f0fcb85c5451b03/parts_and_assemblies_of_car_for_6_brands/by_table/part_image_access/91/c4/bc/82/91c4bc82d73b7fa2a437816bcf240252482faf21.jpg,50064,"2018-12-14 22:21:04",77363,"2018-12-14 22:21:04",,"Porsche Engine Compartment Seal - Oem Supplier 61610689700",$7.59,OEM,,,OEM-61610689700,"356, 356A, 356B, 356C, 356SC",507885,OEM,,
118,"2018-12-19 22:17:18",image/jpeg,3139aef33ff0170a9a3e382bae5620b3a8dec562,33931,/31/39/ae/f3/3139aef33ff0170a9a3e382bae5620b3a8dec562.jpg,,https://songer.datasn.com/data/api/v1/u_e49e7f0fcb85c5451b03/parts_and_assemblies_of_car_for_6_brands/by_table/part_image_access/31/39/ae/f3/3139aef33ff0170a9a3e382bae5620b3a8dec562.jpg,53,"2018-12-11 23:23:06",25,"2018-12-11 23:23:06",,"Volvo A/C Compressor Shim Kit - Genuine Volvo 31332161",$4.66,,,,VOL-31332161,"C30, S40, S60, S80, V50, V70, XC60, XC70, XC90",509935,Genuine,Japan,