part_x_part_brand.id,part.id,part.ts,part.description,part.part,part.price,part.mark,part.star,part.review_count,part.part_number,part.sub_name,part.fcp_euro_number,part.quality,part.made_in,part.mfg_numerbr,part_brand.id,part_brand.ts,part_brand.part_brand,part_brand.description
205,1073,"2018-12-12 02:23:42","**NOTE:** - Seals master cylinder reservoir to master cylinder - Sold and priced each (individually), two required per car <HR>","Volvo Brake Master Cylinder Reservoir O-Ring - Genuine Volvo 30769319",$6.07,,,,VOL-30769319,"S40, S60, S80, V70, XC60, XC70, XC90",478084,Genuine,,,23,"2019-01-08 13:32:35","Genuine Volvo","The original parts used by Volvo to build your car are available as replacement parts under the “Genuine Volvo” brand. Manufactured under the direction of Volvo, expect excellent quality and a premium price since these parts are exclusively available through the Volvo Dealership network. You may not realize this, but the parts that make up your Volvo are not necessarily manufactured by Volvo. No cause for concern, as Volvo designs the part, hires a manufacturer and ensures its quality to you. In fact, many of these manufacturers have been making parts for Volvo for decades and are experts in their own right. In our industry these manufacturers are called OEM (Original Equipment Manufacturers) or OES (Original Equipment Suppliers), and are often brands you recognize including Bosch, Lemforder, TRW, NGK and Sachs. Don’t be surprised to open that Genuine Volvo parts box and find a Lemforder or Bosch branded part inside. If you are looking to buy Genuine Volvo Parts online then you’ve come to the right place. FCP Euro offers both types of product – Genuine Volvo and OEM/OES - from brands we trust to use on our own cars."
206,1074,"2018-12-12 02:23:55",,"Volvo Master Cylinder Sealing Ring - Genuine Volvo 3530985",$3.29,,,,VOL-3530985,"240, 244, 245",32198,Genuine,,,23,"2019-01-08 13:32:35","Genuine Volvo","The original parts used by Volvo to build your car are available as replacement parts under the “Genuine Volvo” brand. Manufactured under the direction of Volvo, expect excellent quality and a premium price since these parts are exclusively available through the Volvo Dealership network. You may not realize this, but the parts that make up your Volvo are not necessarily manufactured by Volvo. No cause for concern, as Volvo designs the part, hires a manufacturer and ensures its quality to you. In fact, many of these manufacturers have been making parts for Volvo for decades and are experts in their own right. In our industry these manufacturers are called OEM (Original Equipment Manufacturers) or OES (Original Equipment Suppliers), and are often brands you recognize including Bosch, Lemforder, TRW, NGK and Sachs. Don’t be surprised to open that Genuine Volvo parts box and find a Lemforder or Bosch branded part inside. If you are looking to buy Genuine Volvo Parts online then you’ve come to the right place. FCP Euro offers both types of product – Genuine Volvo and OEM/OES - from brands we trust to use on our own cars."
207,1075,"2018-12-12 02:24:20",,"Volvo Brake Master Cylinder Reservoir Kit - Genuine Volvo 8683693KT",$75.99,,,,KIT-8683693KT,,517757,Genuine,,,23,"2019-01-08 13:32:35","Genuine Volvo","The original parts used by Volvo to build your car are available as replacement parts under the “Genuine Volvo” brand. Manufactured under the direction of Volvo, expect excellent quality and a premium price since these parts are exclusively available through the Volvo Dealership network. You may not realize this, but the parts that make up your Volvo are not necessarily manufactured by Volvo. No cause for concern, as Volvo designs the part, hires a manufacturer and ensures its quality to you. In fact, many of these manufacturers have been making parts for Volvo for decades and are experts in their own right. In our industry these manufacturers are called OEM (Original Equipment Manufacturers) or OES (Original Equipment Suppliers), and are often brands you recognize including Bosch, Lemforder, TRW, NGK and Sachs. Don’t be surprised to open that Genuine Volvo parts box and find a Lemforder or Bosch branded part inside. If you are looking to buy Genuine Volvo Parts online then you’ve come to the right place. FCP Euro offers both types of product – Genuine Volvo and OEM/OES - from brands we trust to use on our own cars."
208,1076,"2018-12-12 02:24:29",,"Volvo Brake Master Cylinder Reservoir - Genuine Volvo 8683693",$58.29,,,,VOL-8683693,"C30, C70, S40, V50",227825,Genuine,,,23,"2019-01-08 13:32:35","Genuine Volvo","The original parts used by Volvo to build your car are available as replacement parts under the “Genuine Volvo” brand. Manufactured under the direction of Volvo, expect excellent quality and a premium price since these parts are exclusively available through the Volvo Dealership network. You may not realize this, but the parts that make up your Volvo are not necessarily manufactured by Volvo. No cause for concern, as Volvo designs the part, hires a manufacturer and ensures its quality to you. In fact, many of these manufacturers have been making parts for Volvo for decades and are experts in their own right. In our industry these manufacturers are called OEM (Original Equipment Manufacturers) or OES (Original Equipment Suppliers), and are often brands you recognize including Bosch, Lemforder, TRW, NGK and Sachs. Don’t be surprised to open that Genuine Volvo parts box and find a Lemforder or Bosch branded part inside. If you are looking to buy Genuine Volvo Parts online then you’ve come to the right place. FCP Euro offers both types of product – Genuine Volvo and OEM/OES - from brands we trust to use on our own cars."
210,1077,"2018-12-12 02:24:41",,"Volvo Brake Reservoir Grommet - Genuine Volvo 9438754",$8.10,,,,VOL-9438754,"850, C70, S60, S70, S80, V70, XC70",113635,Genuine,,,23,"2019-01-08 13:32:35","Genuine Volvo","The original parts used by Volvo to build your car are available as replacement parts under the “Genuine Volvo” brand. Manufactured under the direction of Volvo, expect excellent quality and a premium price since these parts are exclusively available through the Volvo Dealership network. You may not realize this, but the parts that make up your Volvo are not necessarily manufactured by Volvo. No cause for concern, as Volvo designs the part, hires a manufacturer and ensures its quality to you. In fact, many of these manufacturers have been making parts for Volvo for decades and are experts in their own right. In our industry these manufacturers are called OEM (Original Equipment Manufacturers) or OES (Original Equipment Suppliers), and are often brands you recognize including Bosch, Lemforder, TRW, NGK and Sachs. Don’t be surprised to open that Genuine Volvo parts box and find a Lemforder or Bosch branded part inside. If you are looking to buy Genuine Volvo Parts online then you’ve come to the right place. FCP Euro offers both types of product – Genuine Volvo and OEM/OES - from brands we trust to use on our own cars."
212,1078,"2018-12-12 02:24:49",,"Volvo Brake Reservoir - Genuine Volvo 9200439",$136.84,,,,VOL-9200439,"850, C70, S70, V70",122054,Genuine,,,23,"2019-01-08 13:32:35","Genuine Volvo","The original parts used by Volvo to build your car are available as replacement parts under the “Genuine Volvo” brand. Manufactured under the direction of Volvo, expect excellent quality and a premium price since these parts are exclusively available through the Volvo Dealership network. You may not realize this, but the parts that make up your Volvo are not necessarily manufactured by Volvo. No cause for concern, as Volvo designs the part, hires a manufacturer and ensures its quality to you. In fact, many of these manufacturers have been making parts for Volvo for decades and are experts in their own right. In our industry these manufacturers are called OEM (Original Equipment Manufacturers) or OES (Original Equipment Suppliers), and are often brands you recognize including Bosch, Lemforder, TRW, NGK and Sachs. Don’t be surprised to open that Genuine Volvo parts box and find a Lemforder or Bosch branded part inside. If you are looking to buy Genuine Volvo Parts online then you’ve come to the right place. FCP Euro offers both types of product – Genuine Volvo and OEM/OES - from brands we trust to use on our own cars."
213,1079,"2018-12-12 02:25:03",,"Volvo Brake Master Cylinder Reservoir - Genuine Volvo 8646006",$89.94,,,,VOL-8646006,"S60, S80, V70, XC70",227713,Genuine,,,23,"2019-01-08 13:32:35","Genuine Volvo","The original parts used by Volvo to build your car are available as replacement parts under the “Genuine Volvo” brand. Manufactured under the direction of Volvo, expect excellent quality and a premium price since these parts are exclusively available through the Volvo Dealership network. You may not realize this, but the parts that make up your Volvo are not necessarily manufactured by Volvo. No cause for concern, as Volvo designs the part, hires a manufacturer and ensures its quality to you. In fact, many of these manufacturers have been making parts for Volvo for decades and are experts in their own right. In our industry these manufacturers are called OEM (Original Equipment Manufacturers) or OES (Original Equipment Suppliers), and are often brands you recognize including Bosch, Lemforder, TRW, NGK and Sachs. Don’t be surprised to open that Genuine Volvo parts box and find a Lemforder or Bosch branded part inside. If you are looking to buy Genuine Volvo Parts online then you’ve come to the right place. FCP Euro offers both types of product – Genuine Volvo and OEM/OES - from brands we trust to use on our own cars."
214,1080,"2018-12-12 02:25:07",,"Volvo Brake Fluid Reservoir - Genuine Volvo 8683272",$89.94,,,,VOL-8683272,XC90,115212,Genuine,,,23,"2019-01-08 13:32:35","Genuine Volvo","The original parts used by Volvo to build your car are available as replacement parts under the “Genuine Volvo” brand. Manufactured under the direction of Volvo, expect excellent quality and a premium price since these parts are exclusively available through the Volvo Dealership network. You may not realize this, but the parts that make up your Volvo are not necessarily manufactured by Volvo. No cause for concern, as Volvo designs the part, hires a manufacturer and ensures its quality to you. In fact, many of these manufacturers have been making parts for Volvo for decades and are experts in their own right. In our industry these manufacturers are called OEM (Original Equipment Manufacturers) or OES (Original Equipment Suppliers), and are often brands you recognize including Bosch, Lemforder, TRW, NGK and Sachs. Don’t be surprised to open that Genuine Volvo parts box and find a Lemforder or Bosch branded part inside. If you are looking to buy Genuine Volvo Parts online then you’ve come to the right place. FCP Euro offers both types of product – Genuine Volvo and OEM/OES - from brands we trust to use on our own cars."
215,1081,"2018-12-12 02:25:18",,"Volvo Brake Master Cylinder Reservoir - Genuine Volvo 30665177",$70.94,,,,VOL-30665177,"S60, S80, V70, XC60, XC70",229019,Genuine,,,23,"2019-01-08 13:32:35","Genuine Volvo","The original parts used by Volvo to build your car are available as replacement parts under the “Genuine Volvo” brand. Manufactured under the direction of Volvo, expect excellent quality and a premium price since these parts are exclusively available through the Volvo Dealership network. You may not realize this, but the parts that make up your Volvo are not necessarily manufactured by Volvo. No cause for concern, as Volvo designs the part, hires a manufacturer and ensures its quality to you. In fact, many of these manufacturers have been making parts for Volvo for decades and are experts in their own right. In our industry these manufacturers are called OEM (Original Equipment Manufacturers) or OES (Original Equipment Suppliers), and are often brands you recognize including Bosch, Lemforder, TRW, NGK and Sachs. Don’t be surprised to open that Genuine Volvo parts box and find a Lemforder or Bosch branded part inside. If you are looking to buy Genuine Volvo Parts online then you’ve come to the right place. FCP Euro offers both types of product – Genuine Volvo and OEM/OES - from brands we trust to use on our own cars."
220,1082,"2018-12-12 02:25:42","<desc><p></p><p>The original parts used by Volvo to build your car are available as replacement parts under the “Genuine Volvo” brand. Manufactured under the direction of Volvo, expect excellent quality and a premium price since these parts are exclusively available through the Volvo Dealership network. You may not realize this, but the parts that make up your Volvo are not necessarily manufactured by Volvo. No cause for concern, as Volvo designs the part, hires a manufacturer and ensures its quality to you, including a lifetime warranty. In fact, many of these manufacturers have been making parts for Volvo for decades and are experts in their own right. In our industry these manufacturers are called OEM (Original Equipment Manufacturers) or OES (Original Equipment Suppliers), and are often brands you recognize including Bosch, KYB, NGK and Sachs. Don’t be surprised to open that Genuine Volvo parts box and find a NGK branded part inside. If you are looking to buy Genuine Volvo Parts online then you’ve come to the right place. FCP Euro offers both types of product – Genuine Volvo and OEM/OES - from brands we trust to use on our own cars. If you have any questions on what options are available to you, just give us a call, we are happy to help.</p><p>FCP Euro is an online retailer of Genuine & OEM replacement Volvo parts. Our online catalog offers an extensive range of Volvo parts for all makes and models, as well as replacement parts for all European vehicles. Since 1986 we have been committed to providing our customers only the highest quality Genuine & OEM replacement parts backed with a price match guarantee, free shipping, lifetime warranty and fitment guarantees on every part we sell. With our hassle free 365 day return policy and free tech support you can trust FCP for all of your Volvo replacement part needs.</p></desc>","Volvo Brake Master Cylinder Reservoir - Genuine Volvo 3345685",$39.92,,,,VOL-3345685,"S40, V40",226868,Genuine,,,23,"2019-01-08 13:32:35","Genuine Volvo","The original parts used by Volvo to build your car are available as replacement parts under the “Genuine Volvo” brand. Manufactured under the direction of Volvo, expect excellent quality and a premium price since these parts are exclusively available through the Volvo Dealership network. You may not realize this, but the parts that make up your Volvo are not necessarily manufactured by Volvo. No cause for concern, as Volvo designs the part, hires a manufacturer and ensures its quality to you. In fact, many of these manufacturers have been making parts for Volvo for decades and are experts in their own right. In our industry these manufacturers are called OEM (Original Equipment Manufacturers) or OES (Original Equipment Suppliers), and are often brands you recognize including Bosch, Lemforder, TRW, NGK and Sachs. Don’t be surprised to open that Genuine Volvo parts box and find a Lemforder or Bosch branded part inside. If you are looking to buy Genuine Volvo Parts online then you’ve come to the right place. FCP Euro offers both types of product – Genuine Volvo and OEM/OES - from brands we trust to use on our own cars."
224,1083,"2018-12-12 02:25:49",,"Volvo Brake Master Cylinder Reservoir Cap - Genuine Volvo 31423373",$6.58,,5,2,VOL-31423373,"C30, C70, S40, S60, S80, V50, V70, XC60, XC70, XC90",184814,Genuine,Germany,,23,"2019-01-08 13:32:35","Genuine Volvo","The original parts used by Volvo to build your car are available as replacement parts under the “Genuine Volvo” brand. Manufactured under the direction of Volvo, expect excellent quality and a premium price since these parts are exclusively available through the Volvo Dealership network. You may not realize this, but the parts that make up your Volvo are not necessarily manufactured by Volvo. No cause for concern, as Volvo designs the part, hires a manufacturer and ensures its quality to you. In fact, many of these manufacturers have been making parts for Volvo for decades and are experts in their own right. In our industry these manufacturers are called OEM (Original Equipment Manufacturers) or OES (Original Equipment Suppliers), and are often brands you recognize including Bosch, Lemforder, TRW, NGK and Sachs. Don’t be surprised to open that Genuine Volvo parts box and find a Lemforder or Bosch branded part inside. If you are looking to buy Genuine Volvo Parts online then you’ve come to the right place. FCP Euro offers both types of product – Genuine Volvo and OEM/OES - from brands we trust to use on our own cars."
225,1084,"2018-12-12 02:26:00","**NOTE:** - Volvo Size Designation: 17"" - Actual Diameter Size in Inches: 12.91"" - Actual Diameter Size in Millimeters: 328mm - Comes with 4 pads (enough to service one axle) - Semi metallic - See Fitment Guide","Volvo Brake Pad Set - Ferodo 31277334",$100.29,OE,,,FRD-FDB4238,"XC60, XC90",517358,OE,,FDB4238,1980,"2019-01-04 10:53:07",Ferodo,"Pulsating Grinding Squeeking Rotor Glazing Rotor Hot spots A noticeable lip on the rotors outer edge."
229,1085,"2018-12-12 02:26:10","**NOTE:** - For vehicles with 316mm or 336mm front brake rotors - Comes with 4 pads (enough to service one axle) - Semi metallic - See Fitment Guide","Volvo Brake Pad Set - Ferodo 30793539",$89.69,OE,,,FRD-FDB1898,"S60, S80, V60, V70, XC70",517359,OE,,FDB1898,1980,"2019-01-04 10:53:07",Ferodo,"Pulsating Grinding Squeeking Rotor Glazing Rotor Hot spots A noticeable lip on the rotors outer edge."
230,1086,"2018-12-12 02:26:20","**NOTE:** - For vehicles with 300mm (11.81"") brake discs - Comes with 4 pads (enough to service one axle) - Semi metallic - See Fitment Guide","Volvo Brake Pad Set - Ferodo 30793540",$73.09,OE,,,FRD-FDB1897,"S60, S80, V70, XC70",517361,OE,,FDB1897,1980,"2019-01-04 10:53:07",Ferodo,"Pulsating Grinding Squeeking Rotor Glazing Rotor Hot spots A noticeable lip on the rotors outer edge."
231,1087,"2018-12-12 02:26:31","**FITS THE FOLLOWING:** - 16"" Rotors - Volvo's Brake Rotor Size Designation - 11.81"" Rotors - Actual Rotor Diameter Size in Inches - 300mm Rotors - Actual Rotor Diameter Size in Millimeters **NOTE:** - Set of 4 pads to cover both front wheels - Semi Metallic Compound - See Fitment Guide The FCP Product team has done the research and here is the breakdown: [What are the best brake pads for my car?](/page/what_are_the_best_brake_pads_for_my_car) </p><p>","Volvo Brake Pad Set - Ferodo 30793618",$68.39,OE,,,FRD-FDB1594,"C30, C70, S40, V50",517974,OE,"United Kingdom",FDB1594,1980,"2019-01-04 10:53:07",Ferodo,"Pulsating Grinding Squeeking Rotor Glazing Rotor Hot spots A noticeable lip on the rotors outer edge."
238,1088,"2018-12-12 02:26:42","**NOTE:** - For non vented rotors - For vehicles with mechanically operated parking brake - Comes with 4 pads (enough to service one axle) - Comes with installation hardware - Semi metallic - See Fitment Guide","Volvo Brake Pad Set - Ferodo 30671576",$57.89,OE,,,FRD-FDB1917,"S80, V70, XC70",517360,OE,,,1980,"2019-01-04 10:53:07",Ferodo,"Pulsating Grinding Squeeking Rotor Glazing Rotor Hot spots A noticeable lip on the rotors outer edge."
239,1089,"2018-12-12 02:27:18","**FITS THE FOLLOWING:** - 16.5"" Rotors - Volvo's Brake Rotor Size Designation - 12.6"" Rotors - Actual Rotor Diameter Size in Inches - 320mm Rotors - Actual Rotor Diameter Size in Millimeters **NOTE:** - Set of 4 pads to cover both front wheels - Semi Metallic Compound - Volvo's ""Standard"" Pad - See Fitment Guide The FCP Product team has done the research and here is the breakdown: [What are the best brake pads for my car?](/page/what_are_the_best_brake_pads_for_my_car) </p><p>","Volvo Brake Pad Set - Ferodo 30742029",$55.79,OE,,,FRD-FDB1706,"C70, S40, V50",517976,OE,,FDB1706,1980,"2019-01-04 10:53:07",Ferodo,"Pulsating Grinding Squeeking Rotor Glazing Rotor Hot spots A noticeable lip on the rotors outer edge."
240,1090,"2018-12-12 02:27:23","**FITS THE FOLLOWING:** - 15"" Rotors - Volvo's Brake Rotor Size Designation - 11"" Rotors - Actual Rotor Diameter Size in Inches - 280mm Rotors - Actual Rotor Diameter Size in Millimeters **NOTE:** - Set of 4 pads to cover both front wheels - Semi Metallic Compound - See Fitment Guide The FCP Product team has done the research and here is the breakdown: [What are the best brake pads for my car?](/page/what_are_the_best_brake_pads_for_my_car) </p><p>","Volvo Brake Pad Set 11"" - ATE 31341243",$47.19,OE,,,ATE-607053,"850, C70, S70, V70",518262,OE,"United Kingdom",D796A,1132,"2019-01-10 06:23:45",ATE,"ATE is a division of Continental Automotive Group of Germany with ATE specializing in hydraulic braking solutions for passenger vehicles. ATE is an OEM (Original Equipment Manufacturer) to Volvo, Mercedes, Porsche and many other car brands. With selections including disc brake rotors, brake drums, pads, sensors, and much more, ATE offers quality parts for all aspects of your braking system. ATE is a safe and effective choice for most automobile enthusiasts, as their parts can withstand the rigors associated with every day wear and tear that comes from the daily commute. Continental has a century of experience in the development and production of braking technologies that help to achieve control over the dynamic forces that act on vehicles. As a brake supplier to the world's largest automakers, Continental can effectively leverage its engineering standards to the entire ATE line of brake products. A trusted brand name in Europe for 100 years"
241,1091,"2018-12-12 02:27:28",,"Volvo Brake Pad Set - Jurid 31261185",$19.39,OE,,,JUR-571417J,"142, 144, 145, 164, 240, 242, 244, 245, 262, 264, & more",518035,OE,,571417J,2195,"2019-01-02 01:36:43",Jurid,"Pulsating Grinding Squeeking Rotor Glazing Rotor Hot spots A noticeable lip on the rotors outer edge."
242,1092,"2018-12-12 02:27:39","**NOTE:** - These brake pads are **Semi Metallic** <a name=""video""></a> <h3>How to replace the rear brakes on a Volvo 940(Video)</h3> <div class=""video-wrapper""><iframe width=""492"" height=""277"" src=""//www.youtube.com/embed/AuR1kfqwH2o"" frameborder=""0"" allowfullscreen></iframe></div> <p><i>We're here with Mike Rivera to show you how to replace the rear brakes on a 1993 Volvo 940 Turbo. Don't hesitate to give us a call if you have any questions 1-877-634-0063</i></p>","Volvo Brake Pad Set - ATE 30793802",$15.99,OE,5,4,ATE-604033,"220, 220D, 230, 240, 240D, 242, 244, 245, 250, & more",10039,OE,"Czech Republic",604033,1132,"2019-01-10 06:23:45",ATE,"ATE is a division of Continental Automotive Group of Germany with ATE specializing in hydraulic braking solutions for passenger vehicles. ATE is an OEM (Original Equipment Manufacturer) to Volvo, Mercedes, Porsche and many other car brands. With selections including disc brake rotors, brake drums, pads, sensors, and much more, ATE offers quality parts for all aspects of your braking system. ATE is a safe and effective choice for most automobile enthusiasts, as their parts can withstand the rigors associated with every day wear and tear that comes from the daily commute. Continental has a century of experience in the development and production of braking technologies that help to achieve control over the dynamic forces that act on vehicles. As a brake supplier to the world's largest automakers, Continental can effectively leverage its engineering standards to the entire ATE line of brake products. A trusted brand name in Europe for 100 years"