sub_assemble_part.id,sub_assemble_part.ts,sub_assemble_part.sub_assembly_number,sub_assemble_part.part_number,sub_assemble_part.sub_assembly_name,sub_assemble_part.part_name,sub_assemble_part.price,assemble.id,assemble.ts,assemble.assemble,system.id,system.ts,system.system,sub_model.id,sub_model.ts,sub_model.model_detail,model.id,model.ts,model.model,model.modifications,model.date,serie.id,serie.ts,serie.serie
101,"2020-06-27 01:07:05",12281,,"HANGER, ENGINE, NO.1",,,7,"2020-06-26 13:13:18","TIMING GEAR COVER & REAR END PLATE",1,"2020-06-22 11:25:44","Engine, fuel system",1,"2020-06-22 10:49:26","<td>KZN185L-GKMST</td><td>2000.08 - 2002.11</td><td>1KZTE</td><td>MTM</td><td>Left hand drive</td><td>TDE</td>",1,"2020-06-21 11:25:24",4RUNNER,"KZN185,RZN18#,VZN18#","1995.11 - 2002.11",1,"2020-06-21 11:25:24",4RUNNER
102,"2020-06-27 01:07:05",11301J,,"PLUG, W/HEAD STRAIGHT SCREW(FOR TIMING GEAR CASE)",,,7,"2020-06-26 13:13:18","TIMING GEAR COVER & REAR END PLATE",1,"2020-06-22 11:25:44","Engine, fuel system",1,"2020-06-22 10:49:26","<td>KZN185L-GKMST</td><td>2000.08 - 2002.11</td><td>1KZTE</td><td>MTM</td><td>Left hand drive</td><td>TDE</td>",1,"2020-06-21 11:25:24",4RUNNER,"KZN185,RZN18#,VZN18#","1995.11 - 2002.11",1,"2020-06-21 11:25:24",4RUNNER
103,"2020-06-27 01:07:05",15134B,,"GASKET, OIL PUMP RELIEF VALVE",,,7,"2020-06-26 13:13:18","TIMING GEAR COVER & REAR END PLATE",1,"2020-06-22 11:25:44","Engine, fuel system",1,"2020-06-22 10:49:26","<td>KZN185L-GKMST</td><td>2000.08 - 2002.11</td><td>1KZTE</td><td>MTM</td><td>Left hand drive</td><td>TDE</td>",1,"2020-06-21 11:25:24",4RUNNER,"KZN185,RZN18#,VZN18#","1995.11 - 2002.11",1,"2020-06-21 11:25:24",4RUNNER
104,"2020-06-27 01:07:05",11301A,,"PIN, STRAIGHT(FOR TIMING GEAR CASE)",,,7,"2020-06-26 13:13:18","TIMING GEAR COVER & REAR END PLATE",1,"2020-06-22 11:25:44","Engine, fuel system",1,"2020-06-22 10:49:26","<td>KZN185L-GKMST</td><td>2000.08 - 2002.11</td><td>1KZTE</td><td>MTM</td><td>Left hand drive</td><td>TDE</td>",1,"2020-06-21 11:25:24",4RUNNER,"KZN185,RZN18#,VZN18#","1995.11 - 2002.11",1,"2020-06-21 11:25:24",4RUNNER
105,"2020-06-27 01:07:05",11381A,,"SEAL, ENGINE REAR OIL",,,7,"2020-06-26 13:13:18","TIMING GEAR COVER & REAR END PLATE",1,"2020-06-22 11:25:44","Engine, fuel system",1,"2020-06-22 10:49:26","<td>KZN185L-GKMST</td><td>2000.08 - 2002.11</td><td>1KZTE</td><td>MTM</td><td>Left hand drive</td><td>TDE</td>",1,"2020-06-21 11:25:24",4RUNNER,"KZN185,RZN18#,VZN18#","1995.11 - 2002.11",1,"2020-06-21 11:25:24",4RUNNER
106,"2020-06-27 01:07:05",11381,,"RETAINER, ENGINE REAR OIL SEAL",,,7,"2020-06-26 13:13:18","TIMING GEAR COVER & REAR END PLATE",1,"2020-06-22 11:25:44","Engine, fuel system",1,"2020-06-22 10:49:26","<td>KZN185L-GKMST</td><td>2000.08 - 2002.11</td><td>1KZTE</td><td>MTM</td><td>Left hand drive</td><td>TDE</td>",1,"2020-06-21 11:25:24",4RUNNER,"KZN185,RZN18#,VZN18#","1995.11 - 2002.11",1,"2020-06-21 11:25:24",4RUNNER
107,"2020-06-27 01:07:05",12282,,"HANGER, ENGINE, NO.2",,,7,"2020-06-26 13:13:18","TIMING GEAR COVER & REAR END PLATE",1,"2020-06-22 11:25:44","Engine, fuel system",1,"2020-06-22 10:49:26","<td>KZN185L-GKMST</td><td>2000.08 - 2002.11</td><td>1KZTE</td><td>MTM</td><td>Left hand drive</td><td>TDE</td>",1,"2020-06-21 11:25:24",4RUNNER,"KZN185,RZN18#,VZN18#","1995.11 - 2002.11",1,"2020-06-21 11:25:24",4RUNNER
108,"2020-06-27 01:07:05",11355,,"PLATE, REAR END",,,7,"2020-06-26 13:13:18","TIMING GEAR COVER & REAR END PLATE",1,"2020-06-22 11:25:44","Engine, fuel system",1,"2020-06-22 10:49:26","<td>KZN185L-GKMST</td><td>2000.08 - 2002.11</td><td>1KZTE</td><td>MTM</td><td>Left hand drive</td><td>TDE</td>",1,"2020-06-21 11:25:24",4RUNNER,"KZN185,RZN18#,VZN18#","1995.11 - 2002.11",1,"2020-06-21 11:25:24",4RUNNER
109,"2020-06-27 01:07:05",11356,,"PLATE, REAR END, NO.2",,,7,"2020-06-26 13:13:18","TIMING GEAR COVER & REAR END PLATE",1,"2020-06-22 11:25:44","Engine, fuel system",1,"2020-06-22 10:49:26","<td>KZN185L-GKMST</td><td>2000.08 - 2002.11</td><td>1KZTE</td><td>MTM</td><td>Left hand drive</td><td>TDE</td>",1,"2020-06-21 11:25:24",4RUNNER,"KZN185,RZN18#,VZN18#","1995.11 - 2002.11",1,"2020-06-21 11:25:24",4RUNNER
110,"2020-06-27 01:07:05",1709,,,,,7,"2020-06-26 13:13:18","TIMING GEAR COVER & REAR END PLATE",1,"2020-06-22 11:25:44","Engine, fuel system",1,"2020-06-22 10:49:26","<td>KZN185L-GKMST</td><td>2000.08 - 2002.11</td><td>1KZTE</td><td>MTM</td><td>Left hand drive</td><td>TDE</td>",1,"2020-06-21 11:25:24",4RUNNER,"KZN185,RZN18#,VZN18#","1995.11 - 2002.11",1,"2020-06-21 11:25:24",4RUNNER
111,"2020-06-27 01:07:05",1501,,,,,7,"2020-06-26 13:13:18","TIMING GEAR COVER & REAR END PLATE",1,"2020-06-22 11:25:44","Engine, fuel system",1,"2020-06-22 10:49:26","<td>KZN185L-GKMST</td><td>2000.08 - 2002.11</td><td>1KZTE</td><td>MTM</td><td>Left hand drive</td><td>TDE</td>",1,"2020-06-21 11:25:24",4RUNNER,"KZN185,RZN18#,VZN18#","1995.11 - 2002.11",1,"2020-06-21 11:25:24",4RUNNER
112,"2020-06-27 01:07:05",,90119-06750,,"** Std Part",,7,"2020-06-26 13:13:18","TIMING GEAR COVER & REAR END PLATE",1,"2020-06-22 11:25:44","Engine, fuel system",1,"2020-06-22 10:49:26","<td>KZN185L-GKMST</td><td>2000.08 - 2002.11</td><td>1KZTE</td><td>MTM</td><td>Left hand drive</td><td>TDE</td>",1,"2020-06-21 11:25:24",4RUNNER,"KZN185,RZN18#,VZN18#","1995.11 - 2002.11",1,"2020-06-21 11:25:24",4RUNNER
113,"2020-06-27 01:07:05",11391,,"POINTER, TIMING",,,7,"2020-06-26 13:13:18","TIMING GEAR COVER & REAR END PLATE",1,"2020-06-22 11:25:44","Engine, fuel system",1,"2020-06-22 10:49:26","<td>KZN185L-GKMST</td><td>2000.08 - 2002.11</td><td>1KZTE</td><td>MTM</td><td>Left hand drive</td><td>TDE</td>",1,"2020-06-21 11:25:24",4RUNNER,"KZN185,RZN18#,VZN18#","1995.11 - 2002.11",1,"2020-06-21 11:25:24",4RUNNER
114,"2020-06-27 01:07:05",11302H,,"BOLT, STUD(FOR TIMING GEAR COVER)",,,7,"2020-06-26 13:13:18","TIMING GEAR COVER & REAR END PLATE",1,"2020-06-22 11:25:44","Engine, fuel system",1,"2020-06-22 10:49:26","<td>KZN185L-GKMST</td><td>2000.08 - 2002.11</td><td>1KZTE</td><td>MTM</td><td>Left hand drive</td><td>TDE</td>",1,"2020-06-21 11:25:24",4RUNNER,"KZN185,RZN18#,VZN18#","1995.11 - 2002.11",1,"2020-06-21 11:25:24",4RUNNER
115,"2020-06-27 01:07:05",11301Q,,"SEAL, TYPE T OIL(FOR INJECTION PUMP)",,,7,"2020-06-26 13:13:18","TIMING GEAR COVER & REAR END PLATE",1,"2020-06-22 11:25:44","Engine, fuel system",1,"2020-06-22 10:49:26","<td>KZN185L-GKMST</td><td>2000.08 - 2002.11</td><td>1KZTE</td><td>MTM</td><td>Left hand drive</td><td>TDE</td>",1,"2020-06-21 11:25:24",4RUNNER,"KZN185,RZN18#,VZN18#","1995.11 - 2002.11",1,"2020-06-21 11:25:24",4RUNNER
116,"2020-06-27 01:07:05",11321,,"CASE, TIMING GEAR",,,7,"2020-06-26 13:13:18","TIMING GEAR COVER & REAR END PLATE",1,"2020-06-22 11:25:44","Engine, fuel system",1,"2020-06-22 10:49:26","<td>KZN185L-GKMST</td><td>2000.08 - 2002.11</td><td>1KZTE</td><td>MTM</td><td>Left hand drive</td><td>TDE</td>",1,"2020-06-21 11:25:24",4RUNNER,"KZN185,RZN18#,VZN18#","1995.11 - 2002.11",1,"2020-06-21 11:25:24",4RUNNER
117,"2020-06-27 01:07:05",,90401-10057,,"** Std Part",,7,"2020-06-26 13:13:18","TIMING GEAR COVER & REAR END PLATE",1,"2020-06-22 11:25:44","Engine, fuel system",1,"2020-06-22 10:49:26","<td>KZN185L-GKMST</td><td>2000.08 - 2002.11</td><td>1KZTE</td><td>MTM</td><td>Left hand drive</td><td>TDE</td>",1,"2020-06-21 11:25:24",4RUNNER,"KZN185,RZN18#,VZN18#","1995.11 - 2002.11",1,"2020-06-21 11:25:24",4RUNNER
118,"2020-06-27 01:07:05",,90179-06298,,"** Std Part",,7,"2020-06-26 13:13:18","TIMING GEAR COVER & REAR END PLATE",1,"2020-06-22 11:25:44","Engine, fuel system",1,"2020-06-22 10:49:26","<td>KZN185L-GKMST</td><td>2000.08 - 2002.11</td><td>1KZTE</td><td>MTM</td><td>Left hand drive</td><td>TDE</td>",1,"2020-06-21 11:25:24",4RUNNER,"KZN185,RZN18#,VZN18#","1995.11 - 2002.11",1,"2020-06-21 11:25:24",4RUNNER
119,"2020-06-27 01:07:05",11302A,,"SEAL, OIL(FOR TIMING CHAIN OR BELT COVER)",,,7,"2020-06-26 13:13:18","TIMING GEAR COVER & REAR END PLATE",1,"2020-06-22 11:25:44","Engine, fuel system",1,"2020-06-22 10:49:26","<td>KZN185L-GKMST</td><td>2000.08 - 2002.11</td><td>1KZTE</td><td>MTM</td><td>Left hand drive</td><td>TDE</td>",1,"2020-06-21 11:25:24",4RUNNER,"KZN185,RZN18#,VZN18#","1995.11 - 2002.11",1,"2020-06-21 11:25:24",4RUNNER
120,"2020-06-27 01:07:14",,90179-12024,,"** Std Part",,8,"2020-06-26 13:13:18",MOUNTING,1,"2020-06-22 11:25:44","Engine, fuel system",1,"2020-06-22 10:49:26","<td>KZN185L-GKMST</td><td>2000.08 - 2002.11</td><td>1KZTE</td><td>MTM</td><td>Left hand drive</td><td>TDE</td>",1,"2020-06-21 11:25:24",4RUNNER,"KZN185,RZN18#,VZN18#","1995.11 - 2002.11",1,"2020-06-21 11:25:24",4RUNNER
121,"2020-06-27 01:07:14",,91512-81025,,"BOLT(FOR TORQUE ARM SETTING)",,8,"2020-06-26 13:13:18",MOUNTING,1,"2020-06-22 11:25:44","Engine, fuel system",1,"2020-06-22 10:49:26","<td>KZN185L-GKMST</td><td>2000.08 - 2002.11</td><td>1KZTE</td><td>MTM</td><td>Left hand drive</td><td>TDE</td>",1,"2020-06-21 11:25:24",4RUNNER,"KZN185,RZN18#,VZN18#","1995.11 - 2002.11",1,"2020-06-21 11:25:24",4RUNNER
122,"2020-06-27 01:07:14",12381,,"STABILIZER, ENGINE MOUNTING",,,8,"2020-06-26 13:13:18",MOUNTING,1,"2020-06-22 11:25:44","Engine, fuel system",1,"2020-06-22 10:49:26","<td>KZN185L-GKMST</td><td>2000.08 - 2002.11</td><td>1KZTE</td><td>MTM</td><td>Left hand drive</td><td>TDE</td>",1,"2020-06-21 11:25:24",4RUNNER,"KZN185,RZN18#,VZN18#","1995.11 - 2002.11",1,"2020-06-21 11:25:24",4RUNNER
123,"2020-06-27 01:07:14",12361,,"INSULATOR, ENGINE MOUNTING, FRONT",,,8,"2020-06-26 13:13:18",MOUNTING,1,"2020-06-22 11:25:44","Engine, fuel system",1,"2020-06-22 10:49:26","<td>KZN185L-GKMST</td><td>2000.08 - 2002.11</td><td>1KZTE</td><td>MTM</td><td>Left hand drive</td><td>TDE</td>",1,"2020-06-21 11:25:24",4RUNNER,"KZN185,RZN18#,VZN18#","1995.11 - 2002.11",1,"2020-06-21 11:25:24",4RUNNER
124,"2020-06-27 01:07:14",12311,,"BRACKET, ENGINE MOUNTING, FRONT NO.1 RH",,,8,"2020-06-26 13:13:18",MOUNTING,1,"2020-06-22 11:25:44","Engine, fuel system",1,"2020-06-22 10:49:26","<td>KZN185L-GKMST</td><td>2000.08 - 2002.11</td><td>1KZTE</td><td>MTM</td><td>Left hand drive</td><td>TDE</td>",1,"2020-06-21 11:25:24",4RUNNER,"KZN185,RZN18#,VZN18#","1995.11 - 2002.11",1,"2020-06-21 11:25:24",4RUNNER
125,"2020-06-27 01:07:14",12315,,"BRACKET, ENGINE MOUNTING, FRONT NO.1 LH",,,8,"2020-06-26 13:13:18",MOUNTING,1,"2020-06-22 11:25:44","Engine, fuel system",1,"2020-06-22 10:49:26","<td>KZN185L-GKMST</td><td>2000.08 - 2002.11</td><td>1KZTE</td><td>MTM</td><td>Left hand drive</td><td>TDE</td>",1,"2020-06-21 11:25:24",4RUNNER,"KZN185,RZN18#,VZN18#","1995.11 - 2002.11",1,"2020-06-21 11:25:24",4RUNNER
126,"2020-06-27 01:07:14",,90179-10201,,"** Std Part",,8,"2020-06-26 13:13:18",MOUNTING,1,"2020-06-22 11:25:44","Engine, fuel system",1,"2020-06-22 10:49:26","<td>KZN185L-GKMST</td><td>2000.08 - 2002.11</td><td>1KZTE</td><td>MTM</td><td>Left hand drive</td><td>TDE</td>",1,"2020-06-21 11:25:24",4RUNNER,"KZN185,RZN18#,VZN18#","1995.11 - 2002.11",1,"2020-06-21 11:25:24",4RUNNER
127,"2020-06-27 01:07:14",,90119-10777,,"** Std Part",,8,"2020-06-26 13:13:18",MOUNTING,1,"2020-06-22 11:25:44","Engine, fuel system",1,"2020-06-22 10:49:26","<td>KZN185L-GKMST</td><td>2000.08 - 2002.11</td><td>1KZTE</td><td>MTM</td><td>Left hand drive</td><td>TDE</td>",1,"2020-06-21 11:25:24",4RUNNER,"KZN185,RZN18#,VZN18#","1995.11 - 2002.11",1,"2020-06-21 11:25:24",4RUNNER
128,"2020-06-27 01:07:14",,91511-C0835,,"BOLT(FOR TRANSAXLE CASE & ENGINE SETTING)",,8,"2020-06-26 13:13:18",MOUNTING,1,"2020-06-22 11:25:44","Engine, fuel system",1,"2020-06-22 10:49:26","<td>KZN185L-GKMST</td><td>2000.08 - 2002.11</td><td>1KZTE</td><td>MTM</td><td>Left hand drive</td><td>TDE</td>",1,"2020-06-21 11:25:24",4RUNNER,"KZN185,RZN18#,VZN18#","1995.11 - 2002.11",1,"2020-06-21 11:25:24",4RUNNER
129,"2020-06-27 01:07:14",12511A,,"BUSH, ALTERNATOR BRACKET",,,8,"2020-06-26 13:13:18",MOUNTING,1,"2020-06-22 11:25:44","Engine, fuel system",1,"2020-06-22 10:49:26","<td>KZN185L-GKMST</td><td>2000.08 - 2002.11</td><td>1KZTE</td><td>MTM</td><td>Left hand drive</td><td>TDE</td>",1,"2020-06-21 11:25:24",4RUNNER,"KZN185,RZN18#,VZN18#","1995.11 - 2002.11",1,"2020-06-21 11:25:24",4RUNNER
130,"2020-06-27 01:07:14",1903,,,,,8,"2020-06-26 13:13:18",MOUNTING,1,"2020-06-22 11:25:44","Engine, fuel system",1,"2020-06-22 10:49:26","<td>KZN185L-GKMST</td><td>2000.08 - 2002.11</td><td>1KZTE</td><td>MTM</td><td>Left hand drive</td><td>TDE</td>",1,"2020-06-21 11:25:24",4RUNNER,"KZN185,RZN18#,VZN18#","1995.11 - 2002.11",1,"2020-06-21 11:25:24",4RUNNER
131,"2020-06-27 01:07:14",12511,,"BRACKET, ALTERNATOR, NO.1",,,8,"2020-06-26 13:13:18",MOUNTING,1,"2020-06-22 11:25:44","Engine, fuel system",1,"2020-06-22 10:49:26","<td>KZN185L-GKMST</td><td>2000.08 - 2002.11</td><td>1KZTE</td><td>MTM</td><td>Left hand drive</td><td>TDE</td>",1,"2020-06-21 11:25:24",4RUNNER,"KZN185,RZN18#,VZN18#","1995.11 - 2002.11",1,"2020-06-21 11:25:24",4RUNNER
132,"2020-06-27 01:07:14",,91511-60850,,"BOLT (FOR FRONT OIL PUMP SETTING)",,8,"2020-06-26 13:13:18",MOUNTING,1,"2020-06-22 11:25:44","Engine, fuel system",1,"2020-06-22 10:49:26","<td>KZN185L-GKMST</td><td>2000.08 - 2002.11</td><td>1KZTE</td><td>MTM</td><td>Left hand drive</td><td>TDE</td>",1,"2020-06-21 11:25:24",4RUNNER,"KZN185,RZN18#,VZN18#","1995.11 - 2002.11",1,"2020-06-21 11:25:24",4RUNNER
133,"2020-06-27 01:07:14",,91511-60820,,"BOLT, WASHER BASED HEAD HEXAGON (FOR TRANSFER CASE COVER)",,8,"2020-06-26 13:13:18",MOUNTING,1,"2020-06-22 11:25:44","Engine, fuel system",1,"2020-06-22 10:49:26","<td>KZN185L-GKMST</td><td>2000.08 - 2002.11</td><td>1KZTE</td><td>MTM</td><td>Left hand drive</td><td>TDE</td>",1,"2020-06-21 11:25:24",4RUNNER,"KZN185,RZN18#,VZN18#","1995.11 - 2002.11",1,"2020-06-21 11:25:24",4RUNNER
134,"2020-06-27 01:07:14",12371,,"INSULATOR, ENGINE MOUNTING, REAR NO.1",,,8,"2020-06-26 13:13:18",MOUNTING,1,"2020-06-22 11:25:44","Engine, fuel system",1,"2020-06-22 10:49:26","<td>KZN185L-GKMST</td><td>2000.08 - 2002.11</td><td>1KZTE</td><td>MTM</td><td>Left hand drive</td><td>TDE</td>",1,"2020-06-21 11:25:24",4RUNNER,"KZN185,RZN18#,VZN18#","1995.11 - 2002.11",1,"2020-06-21 11:25:24",4RUNNER
135,"2020-06-27 01:07:14",,90119-10811,,"** Std Part",,8,"2020-06-26 13:13:18",MOUNTING,1,"2020-06-22 11:25:44","Engine, fuel system",1,"2020-06-22 10:49:26","<td>KZN185L-GKMST</td><td>2000.08 - 2002.11</td><td>1KZTE</td><td>MTM</td><td>Left hand drive</td><td>TDE</td>",1,"2020-06-21 11:25:24",4RUNNER,"KZN185,RZN18#,VZN18#","1995.11 - 2002.11",1,"2020-06-21 11:25:24",4RUNNER
136,"2020-06-27 01:07:14",,90119-08B75,,"** Std Part",,8,"2020-06-26 13:13:18",MOUNTING,1,"2020-06-22 11:25:44","Engine, fuel system",1,"2020-06-22 10:49:26","<td>KZN185L-GKMST</td><td>2000.08 - 2002.11</td><td>1KZTE</td><td>MTM</td><td>Left hand drive</td><td>TDE</td>",1,"2020-06-21 11:25:24",4RUNNER,"KZN185,RZN18#,VZN18#","1995.11 - 2002.11",1,"2020-06-21 11:25:24",4RUNNER
137,"2020-06-27 01:07:25",12261,,"HOSE, VENTILATION",,,9,"2020-06-26 13:13:18","VENTILATION HOSE",1,"2020-06-22 11:25:44","Engine, fuel system",1,"2020-06-22 10:49:26","<td>KZN185L-GKMST</td><td>2000.08 - 2002.11</td><td>1KZTE</td><td>MTM</td><td>Left hand drive</td><td>TDE</td>",1,"2020-06-21 11:25:24",4RUNNER,"KZN185,RZN18#,VZN18#","1995.11 - 2002.11",1,"2020-06-21 11:25:24",4RUNNER
138,"2020-06-27 01:07:25",,90929-01365,,"** Std Part",,9,"2020-06-26 13:13:18","VENTILATION HOSE",1,"2020-06-22 11:25:44","Engine, fuel system",1,"2020-06-22 10:49:26","<td>KZN185L-GKMST</td><td>2000.08 - 2002.11</td><td>1KZTE</td><td>MTM</td><td>Left hand drive</td><td>TDE</td>",1,"2020-06-21 11:25:24",4RUNNER,"KZN185,RZN18#,VZN18#","1995.11 - 2002.11",1,"2020-06-21 11:25:24",4RUNNER
139,"2020-06-27 01:07:25",,92122-60610,,"BOLT, STUD(FOR OIL PAN)",,9,"2020-06-26 13:13:18","VENTILATION HOSE",1,"2020-06-22 11:25:44","Engine, fuel system",1,"2020-06-22 10:49:26","<td>KZN185L-GKMST</td><td>2000.08 - 2002.11</td><td>1KZTE</td><td>MTM</td><td>Left hand drive</td><td>TDE</td>",1,"2020-06-21 11:25:24",4RUNNER,"KZN185,RZN18#,VZN18#","1995.11 - 2002.11",1,"2020-06-21 11:25:24",4RUNNER
140,"2020-06-27 01:07:25",,90179-06298,,"** Std Part",,9,"2020-06-26 13:13:18","VENTILATION HOSE",1,"2020-06-22 11:25:44","Engine, fuel system",1,"2020-06-22 10:49:26","<td>KZN185L-GKMST</td><td>2000.08 - 2002.11</td><td>1KZTE</td><td>MTM</td><td>Left hand drive</td><td>TDE</td>",1,"2020-06-21 11:25:24",4RUNNER,"KZN185,RZN18#,VZN18#","1995.11 - 2002.11",1,"2020-06-21 11:25:24",4RUNNER
141,"2020-06-27 01:07:45",13601A,,"BALANCESHAFT SUB-ASSY, NO.1",,,10,"2020-06-26 13:13:18","CRANKSHAFT & PISTON",1,"2020-06-22 11:25:44","Engine, fuel system",1,"2020-06-22 10:49:26","<td>KZN185L-GKMST</td><td>2000.08 - 2002.11</td><td>1KZTE</td><td>MTM</td><td>Left hand drive</td><td>TDE</td>",1,"2020-06-21 11:25:24",4RUNNER,"KZN185,RZN18#,VZN18#","1995.11 - 2002.11",1,"2020-06-21 11:25:24",4RUNNER
142,"2020-06-27 01:07:45",,91511-80612,,"** Std Part",,10,"2020-06-26 13:13:18","CRANKSHAFT & PISTON",1,"2020-06-22 11:25:44","Engine, fuel system",1,"2020-06-22 10:49:26","<td>KZN185L-GKMST</td><td>2000.08 - 2002.11</td><td>1KZTE</td><td>MTM</td><td>Left hand drive</td><td>TDE</td>",1,"2020-06-21 11:25:24",4RUNNER,"KZN185,RZN18#,VZN18#","1995.11 - 2002.11",1,"2020-06-21 11:25:24",4RUNNER
143,"2020-06-27 01:07:45",13632,,"GEAR, BALANCESHAFT DRIVEN, NO.1",,,10,"2020-06-26 13:13:18","CRANKSHAFT & PISTON",1,"2020-06-22 11:25:44","Engine, fuel system",1,"2020-06-22 10:49:26","<td>KZN185L-GKMST</td><td>2000.08 - 2002.11</td><td>1KZTE</td><td>MTM</td><td>Left hand drive</td><td>TDE</td>",1,"2020-06-21 11:25:24",4RUNNER,"KZN185,RZN18#,VZN18#","1995.11 - 2002.11",1,"2020-06-21 11:25:24",4RUNNER
144,"2020-06-27 01:07:45",11011,,"WASHER SET, CRANKSHAFT THRUST",,,10,"2020-06-26 13:13:18","CRANKSHAFT & PISTON",1,"2020-06-22 11:25:44","Engine, fuel system",1,"2020-06-22 10:49:26","<td>KZN185L-GKMST</td><td>2000.08 - 2002.11</td><td>1KZTE</td><td>MTM</td><td>Left hand drive</td><td>TDE</td>",1,"2020-06-21 11:25:24",4RUNNER,"KZN185,RZN18#,VZN18#","1995.11 - 2002.11",1,"2020-06-21 11:25:24",4RUNNER
145,"2020-06-27 01:07:45",13011,,"RING SET, PISTON",,,10,"2020-06-26 13:13:18","CRANKSHAFT & PISTON",1,"2020-06-22 11:25:44","Engine, fuel system",1,"2020-06-22 10:49:26","<td>KZN185L-GKMST</td><td>2000.08 - 2002.11</td><td>1KZTE</td><td>MTM</td><td>Left hand drive</td><td>TDE</td>",1,"2020-06-21 11:25:24",4RUNNER,"KZN185,RZN18#,VZN18#","1995.11 - 2002.11",1,"2020-06-21 11:25:24",4RUNNER
146,"2020-06-27 01:07:45",,90105-08271,,"** Std Part",,10,"2020-06-26 13:13:18","CRANKSHAFT & PISTON",1,"2020-06-22 11:25:44","Engine, fuel system",1,"2020-06-22 10:49:26","<td>KZN185L-GKMST</td><td>2000.08 - 2002.11</td><td>1KZTE</td><td>MTM</td><td>Left hand drive</td><td>TDE</td>",1,"2020-06-21 11:25:24",4RUNNER,"KZN185,RZN18#,VZN18#","1995.11 - 2002.11",1,"2020-06-21 11:25:24",4RUNNER
147,"2020-06-27 01:07:45",13411,,CRANKSHAFT,,,10,"2020-06-26 13:13:18","CRANKSHAFT & PISTON",1,"2020-06-22 11:25:44","Engine, fuel system",1,"2020-06-22 10:49:26","<td>KZN185L-GKMST</td><td>2000.08 - 2002.11</td><td>1KZTE</td><td>MTM</td><td>Left hand drive</td><td>TDE</td>",1,"2020-06-21 11:25:24",4RUNNER,"KZN185,RZN18#,VZN18#","1995.11 - 2002.11",1,"2020-06-21 11:25:24",4RUNNER
148,"2020-06-27 01:07:45",11991,,"WASHER, BALANCESHAFT THRUST",,,10,"2020-06-26 13:13:18","CRANKSHAFT & PISTON",1,"2020-06-22 11:25:44","Engine, fuel system",1,"2020-06-22 10:49:26","<td>KZN185L-GKMST</td><td>2000.08 - 2002.11</td><td>1KZTE</td><td>MTM</td><td>Left hand drive</td><td>TDE</td>",1,"2020-06-21 11:25:24",4RUNNER,"KZN185,RZN18#,VZN18#","1995.11 - 2002.11",1,"2020-06-21 11:25:24",4RUNNER
149,"2020-06-27 01:07:45",13471A,,"KEY, CRANKSHAFT(FOR CRANKSHAFT PULLEY SET)",,,10,"2020-06-26 13:13:18","CRANKSHAFT & PISTON",1,"2020-06-22 11:25:44","Engine, fuel system",1,"2020-06-22 10:49:26","<td>KZN185L-GKMST</td><td>2000.08 - 2002.11</td><td>1KZTE</td><td>MTM</td><td>Left hand drive</td><td>TDE</td>",1,"2020-06-21 11:25:24",4RUNNER,"KZN185,RZN18#,VZN18#","1995.11 - 2002.11",1,"2020-06-21 11:25:24",4RUNNER
150,"2020-06-27 01:07:45",13041,,"BEARING, CONNECTING ROD",,,10,"2020-06-26 13:13:18","CRANKSHAFT & PISTON",1,"2020-06-22 11:25:44","Engine, fuel system",1,"2020-06-22 10:49:26","<td>KZN185L-GKMST</td><td>2000.08 - 2002.11</td><td>1KZTE</td><td>MTM</td><td>Left hand drive</td><td>TDE</td>",1,"2020-06-21 11:25:24",4RUNNER,"KZN185,RZN18#,VZN18#","1995.11 - 2002.11",1,"2020-06-21 11:25:24",4RUNNER
151,"2020-06-27 01:07:45",13202,,"BEARING SET, CONNECTING ROD",,,10,"2020-06-26 13:13:18","CRANKSHAFT & PISTON",1,"2020-06-22 11:25:44","Engine, fuel system",1,"2020-06-22 10:49:26","<td>KZN185L-GKMST</td><td>2000.08 - 2002.11</td><td>1KZTE</td><td>MTM</td><td>Left hand drive</td><td>TDE</td>",1,"2020-06-21 11:25:24",4RUNNER,"KZN185,RZN18#,VZN18#","1995.11 - 2002.11",1,"2020-06-21 11:25:24",4RUNNER
152,"2020-06-27 01:07:45",13581,,"SHAFT, IDLE GEAR, NO.1",,,10,"2020-06-26 13:13:18","CRANKSHAFT & PISTON",1,"2020-06-22 11:25:44","Engine, fuel system",1,"2020-06-22 10:49:26","<td>KZN185L-GKMST</td><td>2000.08 - 2002.11</td><td>1KZTE</td><td>MTM</td><td>Left hand drive</td><td>TDE</td>",1,"2020-06-21 11:25:24",4RUNNER,"KZN185,RZN18#,VZN18#","1995.11 - 2002.11",1,"2020-06-21 11:25:24",4RUNNER
153,"2020-06-27 01:07:45",13538,,"GEAR, IDLE SUB, NO.2",,,10,"2020-06-26 13:13:18","CRANKSHAFT & PISTON",1,"2020-06-22 11:25:44","Engine, fuel system",1,"2020-06-22 10:49:26","<td>KZN185L-GKMST</td><td>2000.08 - 2002.11</td><td>1KZTE</td><td>MTM</td><td>Left hand drive</td><td>TDE</td>",1,"2020-06-21 11:25:24",4RUNNER,"KZN185,RZN18#,VZN18#","1995.11 - 2002.11",1,"2020-06-21 11:25:24",4RUNNER
154,"2020-06-27 01:07:45",13538C,,"RING, SHAFT SNAP",,,10,"2020-06-26 13:13:18","CRANKSHAFT & PISTON",1,"2020-06-22 11:25:44","Engine, fuel system",1,"2020-06-22 10:49:26","<td>KZN185L-GKMST</td><td>2000.08 - 2002.11</td><td>1KZTE</td><td>MTM</td><td>Left hand drive</td><td>TDE</td>",1,"2020-06-21 11:25:24",4RUNNER,"KZN185,RZN18#,VZN18#","1995.11 - 2002.11",1,"2020-06-21 11:25:24",4RUNNER
155,"2020-06-27 01:07:45",13525,,"GEAR, IDLE, NO.1",,,10,"2020-06-26 13:13:18","CRANKSHAFT & PISTON",1,"2020-06-22 11:25:44","Engine, fuel system",1,"2020-06-22 10:49:26","<td>KZN185L-GKMST</td><td>2000.08 - 2002.11</td><td>1KZTE</td><td>MTM</td><td>Left hand drive</td><td>TDE</td>",1,"2020-06-21 11:25:24",4RUNNER,"KZN185,RZN18#,VZN18#","1995.11 - 2002.11",1,"2020-06-21 11:25:24",4RUNNER
156,"2020-06-27 01:07:45",11711,,"BEARING, CRANKSHAFT",,,10,"2020-06-26 13:13:18","CRANKSHAFT & PISTON",1,"2020-06-22 11:25:44","Engine, fuel system",1,"2020-06-22 10:49:26","<td>KZN185L-GKMST</td><td>2000.08 - 2002.11</td><td>1KZTE</td><td>MTM</td><td>Left hand drive</td><td>TDE</td>",1,"2020-06-21 11:25:24",4RUNNER,"KZN185,RZN18#,VZN18#","1995.11 - 2002.11",1,"2020-06-21 11:25:24",4RUNNER
157,"2020-06-27 01:07:46",13578,,"SPRING, IDLE GEAR",,,10,"2020-06-26 13:13:18","CRANKSHAFT & PISTON",1,"2020-06-22 11:25:44","Engine, fuel system",1,"2020-06-22 10:49:26","<td>KZN185L-GKMST</td><td>2000.08 - 2002.11</td><td>1KZTE</td><td>MTM</td><td>Left hand drive</td><td>TDE</td>",1,"2020-06-21 11:25:24",4RUNNER,"KZN185,RZN18#,VZN18#","1995.11 - 2002.11",1,"2020-06-21 11:25:24",4RUNNER
158,"2020-06-27 01:07:46",13521,,"GEAR OR SPROCKET, CRANKSHAFT TIMING",,,10,"2020-06-26 13:13:18","CRANKSHAFT & PISTON",1,"2020-06-22 11:25:44","Engine, fuel system",1,"2020-06-22 10:49:26","<td>KZN185L-GKMST</td><td>2000.08 - 2002.11</td><td>1KZTE</td><td>MTM</td><td>Left hand drive</td><td>TDE</td>",1,"2020-06-21 11:25:24",4RUNNER,"KZN185,RZN18#,VZN18#","1995.11 - 2002.11",1,"2020-06-21 11:25:24",4RUNNER
159,"2020-06-27 01:07:46",,91111-60625,,"** Std Part",,10,"2020-06-26 13:13:18","CRANKSHAFT & PISTON",1,"2020-06-22 11:25:44","Engine, fuel system",1,"2020-06-22 10:49:26","<td>KZN185L-GKMST</td><td>2000.08 - 2002.11</td><td>1KZTE</td><td>MTM</td><td>Left hand drive</td><td>TDE</td>",1,"2020-06-21 11:25:24",4RUNNER,"KZN185,RZN18#,VZN18#","1995.11 - 2002.11",1,"2020-06-21 11:25:24",4RUNNER