sub_assemble_part.id,sub_assemble_part.ts,sub_assemble_part.sub_assembly_number,sub_assemble_part.part_number,sub_assemble_part.sub_assembly_name,sub_assemble_part.part_name,sub_assemble_part.price,assemble.id,assemble.ts,assemble.assemble,system.id,system.ts,system.system,sub_model.id,sub_model.ts,sub_model.model_detail,model.id,model.ts,model.model,model.modifications,model.date,serie.id,serie.ts,serie.serie
201,"2020-06-27 01:08:06",13556,,"SHAFT, TIMING BELT IDLER",,,11,"2020-06-26 13:13:18","CAMSHAFT & VALVE",1,"2020-06-22 11:25:44","Engine, fuel system",1,"2020-06-22 10:49:26","<td>KZN185L-GKMST</td><td>2000.08 - 2002.11</td><td>1KZTE</td><td>MTM</td><td>Left hand drive</td><td>TDE</td>",1,"2020-06-21 11:25:24",4RUNNER,"KZN185,RZN18#,VZN18#","1995.11 - 2002.11",1,"2020-06-21 11:25:24",4RUNNER
202,"2020-06-27 01:08:06",13528,,"GEAR, CAMSHAFT DRIVE",,,11,"2020-06-26 13:13:18","CAMSHAFT & VALVE",1,"2020-06-22 11:25:44","Engine, fuel system",1,"2020-06-22 10:49:26","<td>KZN185L-GKMST</td><td>2000.08 - 2002.11</td><td>1KZTE</td><td>MTM</td><td>Left hand drive</td><td>TDE</td>",1,"2020-06-21 11:25:24",4RUNNER,"KZN185,RZN18#,VZN18#","1995.11 - 2002.11",1,"2020-06-21 11:25:24",4RUNNER
203,"2020-06-27 01:08:06",13585A,,"FLANGE, CAMSHAFT TIMING PULLEY, NO.1",,,11,"2020-06-26 13:13:18","CAMSHAFT & VALVE",1,"2020-06-22 11:25:44","Engine, fuel system",1,"2020-06-22 10:49:26","<td>KZN185L-GKMST</td><td>2000.08 - 2002.11</td><td>1KZTE</td><td>MTM</td><td>Left hand drive</td><td>TDE</td>",1,"2020-06-21 11:25:24",4RUNNER,"KZN185,RZN18#,VZN18#","1995.11 - 2002.11",1,"2020-06-21 11:25:24",4RUNNER
204,"2020-06-27 01:08:06",,91511-80614,,"** Std Part",,11,"2020-06-26 13:13:18","CAMSHAFT & VALVE",1,"2020-06-22 11:25:44","Engine, fuel system",1,"2020-06-22 10:49:26","<td>KZN185L-GKMST</td><td>2000.08 - 2002.11</td><td>1KZTE</td><td>MTM</td><td>Left hand drive</td><td>TDE</td>",1,"2020-06-21 11:25:24",4RUNNER,"KZN185,RZN18#,VZN18#","1995.11 - 2002.11",1,"2020-06-21 11:25:24",4RUNNER
205,"2020-06-27 01:08:13",15133,,"PLUG, OIL PUMP RELIEF VALVE",,,12,"2020-06-26 13:13:18","ENGINE OIL PUMP",1,"2020-06-22 11:25:44","Engine, fuel system",1,"2020-06-22 10:49:26","<td>KZN185L-GKMST</td><td>2000.08 - 2002.11</td><td>1KZTE</td><td>MTM</td><td>Left hand drive</td><td>TDE</td>",1,"2020-06-21 11:25:24",4RUNNER,"KZN185,RZN18#,VZN18#","1995.11 - 2002.11",1,"2020-06-21 11:25:24",4RUNNER
206,"2020-06-27 01:08:13",15134,,"GASKET, OIL PUMP RELIEF VALVE",,,12,"2020-06-26 13:13:18","ENGINE OIL PUMP",1,"2020-06-22 11:25:44","Engine, fuel system",1,"2020-06-22 10:49:26","<td>KZN185L-GKMST</td><td>2000.08 - 2002.11</td><td>1KZTE</td><td>MTM</td><td>Left hand drive</td><td>TDE</td>",1,"2020-06-21 11:25:24",4RUNNER,"KZN185,RZN18#,VZN18#","1995.11 - 2002.11",1,"2020-06-21 11:25:24",4RUNNER
207,"2020-06-27 01:08:13",15193,,"GASKET, OIL PUMP",,,12,"2020-06-26 13:13:18","ENGINE OIL PUMP",1,"2020-06-22 11:25:44","Engine, fuel system",1,"2020-06-22 10:49:26","<td>KZN185L-GKMST</td><td>2000.08 - 2002.11</td><td>1KZTE</td><td>MTM</td><td>Left hand drive</td><td>TDE</td>",1,"2020-06-21 11:25:24",4RUNNER,"KZN185,RZN18#,VZN18#","1995.11 - 2002.11",1,"2020-06-21 11:25:24",4RUNNER
208,"2020-06-27 01:08:13",15132,,"SPRING, OIL PUMP RELIEF VALVE",,,12,"2020-06-26 13:13:18","ENGINE OIL PUMP",1,"2020-06-22 11:25:44","Engine, fuel system",1,"2020-06-22 10:49:26","<td>KZN185L-GKMST</td><td>2000.08 - 2002.11</td><td>1KZTE</td><td>MTM</td><td>Left hand drive</td><td>TDE</td>",1,"2020-06-21 11:25:24",4RUNNER,"KZN185,RZN18#,VZN18#","1995.11 - 2002.11",1,"2020-06-21 11:25:24",4RUNNER
209,"2020-06-27 01:08:13",15131,,"VALVE, OIL PUMP RELIEF",,,12,"2020-06-26 13:13:18","ENGINE OIL PUMP",1,"2020-06-22 11:25:44","Engine, fuel system",1,"2020-06-22 10:49:26","<td>KZN185L-GKMST</td><td>2000.08 - 2002.11</td><td>1KZTE</td><td>MTM</td><td>Left hand drive</td><td>TDE</td>",1,"2020-06-21 11:25:24",4RUNNER,"KZN185,RZN18#,VZN18#","1995.11 - 2002.11",1,"2020-06-21 11:25:24",4RUNNER
210,"2020-06-27 01:08:13",15104E,,"BOLT, STUD(FOR OIL STRAINER)",,,12,"2020-06-26 13:13:18","ENGINE OIL PUMP",1,"2020-06-22 11:25:44","Engine, fuel system",1,"2020-06-22 10:49:26","<td>KZN185L-GKMST</td><td>2000.08 - 2002.11</td><td>1KZTE</td><td>MTM</td><td>Left hand drive</td><td>TDE</td>",1,"2020-06-21 11:25:24",4RUNNER,"KZN185,RZN18#,VZN18#","1995.11 - 2002.11",1,"2020-06-21 11:25:24",4RUNNER
211,"2020-06-27 01:08:13",15149,,"GASKET, OIL STRAINER FLANGE",,,12,"2020-06-26 13:13:18","ENGINE OIL PUMP",1,"2020-06-22 11:25:44","Engine, fuel system",1,"2020-06-22 10:49:26","<td>KZN185L-GKMST</td><td>2000.08 - 2002.11</td><td>1KZTE</td><td>MTM</td><td>Left hand drive</td><td>TDE</td>",1,"2020-06-21 11:25:24",4RUNNER,"KZN185,RZN18#,VZN18#","1995.11 - 2002.11",1,"2020-06-21 11:25:24",4RUNNER
212,"2020-06-27 01:08:13",,90179-06298,,"** Std Part",,12,"2020-06-26 13:13:18","ENGINE OIL PUMP",1,"2020-06-22 11:25:44","Engine, fuel system",1,"2020-06-22 10:49:26","<td>KZN185L-GKMST</td><td>2000.08 - 2002.11</td><td>1KZTE</td><td>MTM</td><td>Left hand drive</td><td>TDE</td>",1,"2020-06-21 11:25:24",4RUNNER,"KZN185,RZN18#,VZN18#","1995.11 - 2002.11",1,"2020-06-21 11:25:24",4RUNNER
213,"2020-06-27 01:08:13",,90119-06754,,"** Std Part",,12,"2020-06-26 13:13:18","ENGINE OIL PUMP",1,"2020-06-22 11:25:44","Engine, fuel system",1,"2020-06-22 10:49:26","<td>KZN185L-GKMST</td><td>2000.08 - 2002.11</td><td>1KZTE</td><td>MTM</td><td>Left hand drive</td><td>TDE</td>",1,"2020-06-21 11:25:24",4RUNNER,"KZN185,RZN18#,VZN18#","1995.11 - 2002.11",1,"2020-06-21 11:25:24",4RUNNER
214,"2020-06-27 01:08:13",15104,,"STRAINER SUB-ASSY, OIL",,,12,"2020-06-26 13:13:18","ENGINE OIL PUMP",1,"2020-06-22 11:25:44","Engine, fuel system",1,"2020-06-22 10:49:26","<td>KZN185L-GKMST</td><td>2000.08 - 2002.11</td><td>1KZTE</td><td>MTM</td><td>Left hand drive</td><td>TDE</td>",1,"2020-06-21 11:25:24",4RUNNER,"KZN185,RZN18#,VZN18#","1995.11 - 2002.11",1,"2020-06-21 11:25:24",4RUNNER
215,"2020-06-27 01:08:19",15725A,,"GASKET, OIL COOLER COVER",,,13,"2020-06-26 13:13:18","OIL FILTER",1,"2020-06-22 11:25:44","Engine, fuel system",1,"2020-06-22 10:49:26","<td>KZN185L-GKMST</td><td>2000.08 - 2002.11</td><td>1KZTE</td><td>MTM</td><td>Left hand drive</td><td>TDE</td>",1,"2020-06-21 11:25:24",4RUNNER,"KZN185,RZN18#,VZN18#","1995.11 - 2002.11",1,"2020-06-21 11:25:24",4RUNNER
216,"2020-06-27 01:08:19",15601,,"FILTER SUB-ASSY, OIL",,,13,"2020-06-26 13:13:18","OIL FILTER",1,"2020-06-22 11:25:44","Engine, fuel system",1,"2020-06-22 10:49:26","<td>KZN185L-GKMST</td><td>2000.08 - 2002.11</td><td>1KZTE</td><td>MTM</td><td>Left hand drive</td><td>TDE</td>",1,"2020-06-21 11:25:24",4RUNNER,"KZN185,RZN18#,VZN18#","1995.11 - 2002.11",1,"2020-06-21 11:25:24",4RUNNER
217,"2020-06-27 01:08:19",15600A,,"UNION(FOR OIL FILTER)",,,13,"2020-06-26 13:13:18","OIL FILTER",1,"2020-06-22 11:25:44","Engine, fuel system",1,"2020-06-22 10:49:26","<td>KZN185L-GKMST</td><td>2000.08 - 2002.11</td><td>1KZTE</td><td>MTM</td><td>Left hand drive</td><td>TDE</td>",1,"2020-06-21 11:25:24",4RUNNER,"KZN185,RZN18#,VZN18#","1995.11 - 2002.11",1,"2020-06-21 11:25:24",4RUNNER
218,"2020-06-27 01:08:19",1105,,,,,13,"2020-06-26 13:13:18","OIL FILTER",1,"2020-06-22 11:25:44","Engine, fuel system",1,"2020-06-22 10:49:26","<td>KZN185L-GKMST</td><td>2000.08 - 2002.11</td><td>1KZTE</td><td>MTM</td><td>Left hand drive</td><td>TDE</td>",1,"2020-06-21 11:25:24",4RUNNER,"KZN185,RZN18#,VZN18#","1995.11 - 2002.11",1,"2020-06-21 11:25:24",4RUNNER
219,"2020-06-27 01:08:19",15690B,,"VALVE ASSY, OIL COOLER RELIEF",,,13,"2020-06-26 13:13:18","OIL FILTER",1,"2020-06-22 11:25:44","Engine, fuel system",1,"2020-06-22 10:49:26","<td>KZN185L-GKMST</td><td>2000.08 - 2002.11</td><td>1KZTE</td><td>MTM</td><td>Left hand drive</td><td>TDE</td>",1,"2020-06-21 11:25:24",4RUNNER,"KZN185,RZN18#,VZN18#","1995.11 - 2002.11",1,"2020-06-21 11:25:24",4RUNNER
220,"2020-06-27 01:08:19",,90430-22003,,"GASKET, STRAIGHT SCREW PLUG NO.3(FOR CYLINDER BLOCK)",,13,"2020-06-26 13:13:18","OIL FILTER",1,"2020-06-22 11:25:44","Engine, fuel system",1,"2020-06-22 10:49:26","<td>KZN185L-GKMST</td><td>2000.08 - 2002.11</td><td>1KZTE</td><td>MTM</td><td>Left hand drive</td><td>TDE</td>",1,"2020-06-21 11:25:24",4RUNNER,"KZN185,RZN18#,VZN18#","1995.11 - 2002.11",1,"2020-06-21 11:25:24",4RUNNER
221,"2020-06-27 01:08:19",,90179-06298,,"** Std Part",,13,"2020-06-26 13:13:18","OIL FILTER",1,"2020-06-22 11:25:44","Engine, fuel system",1,"2020-06-22 10:49:26","<td>KZN185L-GKMST</td><td>2000.08 - 2002.11</td><td>1KZTE</td><td>MTM</td><td>Left hand drive</td><td>TDE</td>",1,"2020-06-21 11:25:24",4RUNNER,"KZN185,RZN18#,VZN18#","1995.11 - 2002.11",1,"2020-06-21 11:25:24",4RUNNER
222,"2020-06-27 01:08:19",15609D,,"PLUG, W/HEAD STRAIGHT SCREW(FOR OIL FILTER BRACKET)",,,13,"2020-06-26 13:13:18","OIL FILTER",1,"2020-06-22 11:25:44","Engine, fuel system",1,"2020-06-22 10:49:26","<td>KZN185L-GKMST</td><td>2000.08 - 2002.11</td><td>1KZTE</td><td>MTM</td><td>Left hand drive</td><td>TDE</td>",1,"2020-06-21 11:25:24",4RUNNER,"KZN185,RZN18#,VZN18#","1995.11 - 2002.11",1,"2020-06-21 11:25:24",4RUNNER
223,"2020-06-27 01:08:19",15701C,,"COVER SUB-ASSY, OIL COOLER",,,13,"2020-06-26 13:13:18","OIL FILTER",1,"2020-06-22 11:25:44","Engine, fuel system",1,"2020-06-22 10:49:26","<td>KZN185L-GKMST</td><td>2000.08 - 2002.11</td><td>1KZTE</td><td>MTM</td><td>Left hand drive</td><td>TDE</td>",1,"2020-06-21 11:25:24",4RUNNER,"KZN185,RZN18#,VZN18#","1995.11 - 2002.11",1,"2020-06-21 11:25:24",4RUNNER
224,"2020-06-27 01:08:19",15609E,,"GASKET, W/HEAD STRAIGHT SCREW PLUG",,,13,"2020-06-26 13:13:18","OIL FILTER",1,"2020-06-22 11:25:44","Engine, fuel system",1,"2020-06-22 10:49:26","<td>KZN185L-GKMST</td><td>2000.08 - 2002.11</td><td>1KZTE</td><td>MTM</td><td>Left hand drive</td><td>TDE</td>",1,"2020-06-21 11:25:24",4RUNNER,"KZN185,RZN18#,VZN18#","1995.11 - 2002.11",1,"2020-06-21 11:25:24",4RUNNER
225,"2020-06-27 01:08:19",,95421-75060,,"** Std Part",,13,"2020-06-26 13:13:18","OIL FILTER",1,"2020-06-22 11:25:44","Engine, fuel system",1,"2020-06-22 10:49:26","<td>KZN185L-GKMST</td><td>2000.08 - 2002.11</td><td>1KZTE</td><td>MTM</td><td>Left hand drive</td><td>TDE</td>",1,"2020-06-21 11:25:24",4RUNNER,"KZN185,RZN18#,VZN18#","1995.11 - 2002.11",1,"2020-06-21 11:25:24",4RUNNER
226,"2020-06-27 01:08:19",,90119-06749,,"** Std Part",,13,"2020-06-26 13:13:18","OIL FILTER",1,"2020-06-22 11:25:44","Engine, fuel system",1,"2020-06-22 10:49:26","<td>KZN185L-GKMST</td><td>2000.08 - 2002.11</td><td>1KZTE</td><td>MTM</td><td>Left hand drive</td><td>TDE</td>",1,"2020-06-21 11:25:24",4RUNNER,"KZN185,RZN18#,VZN18#","1995.11 - 2002.11",1,"2020-06-21 11:25:24",4RUNNER
227,"2020-06-27 01:08:19",,90339-10015,,"** Std Part",,13,"2020-06-26 13:13:18","OIL FILTER",1,"2020-06-22 11:25:44","Engine, fuel system",1,"2020-06-22 10:49:26","<td>KZN185L-GKMST</td><td>2000.08 - 2002.11</td><td>1KZTE</td><td>MTM</td><td>Left hand drive</td><td>TDE</td>",1,"2020-06-21 11:25:24",4RUNNER,"KZN185,RZN18#,VZN18#","1995.11 - 2002.11",1,"2020-06-21 11:25:24",4RUNNER
228,"2020-06-27 01:08:19",,90467-15022,,"CLAMP OR CLIP, HOSE(FOR WATER BY-PASS HOSE)",,13,"2020-06-26 13:13:18","OIL FILTER",1,"2020-06-22 11:25:44","Engine, fuel system",1,"2020-06-22 10:49:26","<td>KZN185L-GKMST</td><td>2000.08 - 2002.11</td><td>1KZTE</td><td>MTM</td><td>Left hand drive</td><td>TDE</td>",1,"2020-06-21 11:25:24",4RUNNER,"KZN185,RZN18#,VZN18#","1995.11 - 2002.11",1,"2020-06-21 11:25:24",4RUNNER
229,"2020-06-27 01:08:23",15785,,"GASKET, OIL COOLER",,,14,"2020-06-26 13:13:18","ENGINE OIL COOLER",1,"2020-06-22 11:25:44","Engine, fuel system",1,"2020-06-22 10:49:26","<td>KZN185L-GKMST</td><td>2000.08 - 2002.11</td><td>1KZTE</td><td>MTM</td><td>Left hand drive</td><td>TDE</td>",1,"2020-06-21 11:25:24",4RUNNER,"KZN185,RZN18#,VZN18#","1995.11 - 2002.11",1,"2020-06-21 11:25:24",4RUNNER
230,"2020-06-27 01:08:23",15710,,"COOLER ASSY, OIL",,,14,"2020-06-26 13:13:18","ENGINE OIL COOLER",1,"2020-06-22 11:25:44","Engine, fuel system",1,"2020-06-22 10:49:26","<td>KZN185L-GKMST</td><td>2000.08 - 2002.11</td><td>1KZTE</td><td>MTM</td><td>Left hand drive</td><td>TDE</td>",1,"2020-06-21 11:25:24",4RUNNER,"KZN185,RZN18#,VZN18#","1995.11 - 2002.11",1,"2020-06-21 11:25:24",4RUNNER
231,"2020-06-27 01:08:23",,90179-08150,,"** Std Part",,14,"2020-06-26 13:13:18","ENGINE OIL COOLER",1,"2020-06-22 11:25:44","Engine, fuel system",1,"2020-06-22 10:49:26","<td>KZN185L-GKMST</td><td>2000.08 - 2002.11</td><td>1KZTE</td><td>MTM</td><td>Left hand drive</td><td>TDE</td>",1,"2020-06-21 11:25:24",4RUNNER,"KZN185,RZN18#,VZN18#","1995.11 - 2002.11",1,"2020-06-21 11:25:24",4RUNNER
232,"2020-06-27 01:08:43",16371,,"PULLEY, FAN",,,15,"2020-06-26 13:13:18","WATER PUMP",1,"2020-06-22 11:25:44","Engine, fuel system",1,"2020-06-22 10:49:26","<td>KZN185L-GKMST</td><td>2000.08 - 2002.11</td><td>1KZTE</td><td>MTM</td><td>Left hand drive</td><td>TDE</td>",1,"2020-06-21 11:25:24",4RUNNER,"KZN185,RZN18#,VZN18#","1995.11 - 2002.11",1,"2020-06-21 11:25:24",4RUNNER
233,"2020-06-27 01:08:43",,90179-08150,,"** Std Part",,15,"2020-06-26 13:13:18","WATER PUMP",1,"2020-06-22 11:25:44","Engine, fuel system",1,"2020-06-22 10:49:26","<td>KZN185L-GKMST</td><td>2000.08 - 2002.11</td><td>1KZTE</td><td>MTM</td><td>Left hand drive</td><td>TDE</td>",1,"2020-06-21 11:25:24",4RUNNER,"KZN185,RZN18#,VZN18#","1995.11 - 2002.11",1,"2020-06-21 11:25:24",4RUNNER
234,"2020-06-27 01:08:43",16210,,"COUPLING ASSY, FLUID",,,15,"2020-06-26 13:13:18","WATER PUMP",1,"2020-06-22 11:25:44","Engine, fuel system",1,"2020-06-22 10:49:26","<td>KZN185L-GKMST</td><td>2000.08 - 2002.11</td><td>1KZTE</td><td>MTM</td><td>Left hand drive</td><td>TDE</td>",1,"2020-06-21 11:25:24",4RUNNER,"KZN185,RZN18#,VZN18#","1995.11 - 2002.11",1,"2020-06-21 11:25:24",4RUNNER
235,"2020-06-27 01:08:43",16100,,"PUMP ASSY, ENGINE WATER",,,15,"2020-06-26 13:13:18","WATER PUMP",1,"2020-06-22 11:25:44","Engine, fuel system",1,"2020-06-22 10:49:26","<td>KZN185L-GKMST</td><td>2000.08 - 2002.11</td><td>1KZTE</td><td>MTM</td><td>Left hand drive</td><td>TDE</td>",1,"2020-06-21 11:25:24",4RUNNER,"KZN185,RZN18#,VZN18#","1995.11 - 2002.11",1,"2020-06-21 11:25:24",4RUNNER
236,"2020-06-27 01:08:43",16110C,,"PUMP ASSY, WATER, W/O COVER",,,15,"2020-06-26 13:13:18","WATER PUMP",1,"2020-06-22 11:25:44","Engine, fuel system",1,"2020-06-22 10:49:26","<td>KZN185L-GKMST</td><td>2000.08 - 2002.11</td><td>1KZTE</td><td>MTM</td><td>Left hand drive</td><td>TDE</td>",1,"2020-06-21 11:25:24",4RUNNER,"KZN185,RZN18#,VZN18#","1995.11 - 2002.11",1,"2020-06-21 11:25:24",4RUNNER
237,"2020-06-27 01:08:43",,90116-08112,,"BOLT, STUD(FOR CENTRIFUGAL OIL FILTER SETTING)",,15,"2020-06-26 13:13:18","WATER PUMP",1,"2020-06-22 11:25:44","Engine, fuel system",1,"2020-06-22 10:49:26","<td>KZN185L-GKMST</td><td>2000.08 - 2002.11</td><td>1KZTE</td><td>MTM</td><td>Left hand drive</td><td>TDE</td>",1,"2020-06-21 11:25:24",4RUNNER,"KZN185,RZN18#,VZN18#","1995.11 - 2002.11",1,"2020-06-21 11:25:24",4RUNNER
238,"2020-06-27 01:08:43",16124,,"GASKET, WATER PUMP COVER",,,15,"2020-06-26 13:13:18","WATER PUMP",1,"2020-06-22 11:25:44","Engine, fuel system",1,"2020-06-22 10:49:26","<td>KZN185L-GKMST</td><td>2000.08 - 2002.11</td><td>1KZTE</td><td>MTM</td><td>Left hand drive</td><td>TDE</td>",1,"2020-06-21 11:25:24",4RUNNER,"KZN185,RZN18#,VZN18#","1995.11 - 2002.11",1,"2020-06-21 11:25:24",4RUNNER
239,"2020-06-27 01:08:43",16271,,"GASKET, WATER PUMP",,,15,"2020-06-26 13:13:18","WATER PUMP",1,"2020-06-22 11:25:44","Engine, fuel system",1,"2020-06-22 10:49:26","<td>KZN185L-GKMST</td><td>2000.08 - 2002.11</td><td>1KZTE</td><td>MTM</td><td>Left hand drive</td><td>TDE</td>",1,"2020-06-21 11:25:24",4RUNNER,"KZN185,RZN18#,VZN18#","1995.11 - 2002.11",1,"2020-06-21 11:25:24",4RUNNER
240,"2020-06-27 01:08:43",,16193-88460,,"** Std Part",,15,"2020-06-26 13:13:18","WATER PUMP",1,"2020-06-22 11:25:44","Engine, fuel system",1,"2020-06-22 10:49:26","<td>KZN185L-GKMST</td><td>2000.08 - 2002.11</td><td>1KZTE</td><td>MTM</td><td>Left hand drive</td><td>TDE</td>",1,"2020-06-21 11:25:24",4RUNNER,"KZN185,RZN18#,VZN18#","1995.11 - 2002.11",1,"2020-06-21 11:25:24",4RUNNER
241,"2020-06-27 01:08:43",16100B,,"PIN, RING(FOR WATER PUMP SET)",,,15,"2020-06-26 13:13:18","WATER PUMP",1,"2020-06-22 11:25:44","Engine, fuel system",1,"2020-06-22 10:49:26","<td>KZN185L-GKMST</td><td>2000.08 - 2002.11</td><td>1KZTE</td><td>MTM</td><td>Left hand drive</td><td>TDE</td>",1,"2020-06-21 11:25:24",4RUNNER,"KZN185,RZN18#,VZN18#","1995.11 - 2002.11",1,"2020-06-21 11:25:24",4RUNNER
242,"2020-06-27 01:08:43",,90119-06751,,"** Std Part",,15,"2020-06-26 13:13:18","WATER PUMP",1,"2020-06-22 11:25:44","Engine, fuel system",1,"2020-06-22 10:49:26","<td>KZN185L-GKMST</td><td>2000.08 - 2002.11</td><td>1KZTE</td><td>MTM</td><td>Left hand drive</td><td>TDE</td>",1,"2020-06-21 11:25:24",4RUNNER,"KZN185,RZN18#,VZN18#","1995.11 - 2002.11",1,"2020-06-21 11:25:24",4RUNNER
243,"2020-06-27 01:08:43",,90119-06749,,"** Std Part",,15,"2020-06-26 13:13:18","WATER PUMP",1,"2020-06-22 11:25:44","Engine, fuel system",1,"2020-06-22 10:49:26","<td>KZN185L-GKMST</td><td>2000.08 - 2002.11</td><td>1KZTE</td><td>MTM</td><td>Left hand drive</td><td>TDE</td>",1,"2020-06-21 11:25:24",4RUNNER,"KZN185,RZN18#,VZN18#","1995.11 - 2002.11",1,"2020-06-21 11:25:24",4RUNNER
244,"2020-06-27 01:08:43",,90179-06298,,"** Std Part",,15,"2020-06-26 13:13:18","WATER PUMP",1,"2020-06-22 11:25:44","Engine, fuel system",1,"2020-06-22 10:49:26","<td>KZN185L-GKMST</td><td>2000.08 - 2002.11</td><td>1KZTE</td><td>MTM</td><td>Left hand drive</td><td>TDE</td>",1,"2020-06-21 11:25:24",4RUNNER,"KZN185,RZN18#,VZN18#","1995.11 - 2002.11",1,"2020-06-21 11:25:24",4RUNNER
245,"2020-06-27 01:08:58",,91643-80635,,"** Std Part",,16,"2020-06-26 13:13:18","RADIATOR & WATER OUTLET",1,"2020-06-22 11:25:44","Engine, fuel system",1,"2020-06-22 10:49:26","<td>KZN185L-GKMST</td><td>2000.08 - 2002.11</td><td>1KZTE</td><td>MTM</td><td>Left hand drive</td><td>TDE</td>",1,"2020-06-21 11:25:24",4RUNNER,"KZN185,RZN18#,VZN18#","1995.11 - 2002.11",1,"2020-06-21 11:25:24",4RUNNER
246,"2020-06-27 01:08:58",,90105-06220,,"** Std Part",,16,"2020-06-26 13:13:18","RADIATOR & WATER OUTLET",1,"2020-06-22 11:25:44","Engine, fuel system",1,"2020-06-22 10:49:26","<td>KZN185L-GKMST</td><td>2000.08 - 2002.11</td><td>1KZTE</td><td>MTM</td><td>Left hand drive</td><td>TDE</td>",1,"2020-06-21 11:25:24",4RUNNER,"KZN185,RZN18#,VZN18#","1995.11 - 2002.11",1,"2020-06-21 11:25:24",4RUNNER
247,"2020-06-27 01:08:58",,90179-06080,,"** Std Part",,16,"2020-06-26 13:13:18","RADIATOR & WATER OUTLET",1,"2020-06-22 11:25:44","Engine, fuel system",1,"2020-06-22 10:49:26","<td>KZN185L-GKMST</td><td>2000.08 - 2002.11</td><td>1KZTE</td><td>MTM</td><td>Left hand drive</td><td>TDE</td>",1,"2020-06-21 11:25:24",4RUNNER,"KZN185,RZN18#,VZN18#","1995.11 - 2002.11",1,"2020-06-21 11:25:24",4RUNNER
248,"2020-06-27 01:08:58",16331A,,THERMOSTAT,,,16,"2020-06-26 13:13:18","RADIATOR & WATER OUTLET",1,"2020-06-22 11:25:44","Engine, fuel system",1,"2020-06-22 10:49:26","<td>KZN185L-GKMST</td><td>2000.08 - 2002.11</td><td>1KZTE</td><td>MTM</td><td>Left hand drive</td><td>TDE</td>",1,"2020-06-21 11:25:24",4RUNNER,"KZN185,RZN18#,VZN18#","1995.11 - 2002.11",1,"2020-06-21 11:25:24",4RUNNER
249,"2020-06-27 01:08:58",,91511-60610,,"** Std Part",,16,"2020-06-26 13:13:18","RADIATOR & WATER OUTLET",1,"2020-06-22 11:25:44","Engine, fuel system",1,"2020-06-22 10:49:26","<td>KZN185L-GKMST</td><td>2000.08 - 2002.11</td><td>1KZTE</td><td>MTM</td><td>Left hand drive</td><td>TDE</td>",1,"2020-06-21 11:25:24",4RUNNER,"KZN185,RZN18#,VZN18#","1995.11 - 2002.11",1,"2020-06-21 11:25:24",4RUNNER
250,"2020-06-27 01:08:58",16027,,"PIPE SUB-ASSY, TURBO WATER, NO.1",,,16,"2020-06-26 13:13:18","RADIATOR & WATER OUTLET",1,"2020-06-22 11:25:44","Engine, fuel system",1,"2020-06-22 10:49:26","<td>KZN185L-GKMST</td><td>2000.08 - 2002.11</td><td>1KZTE</td><td>MTM</td><td>Left hand drive</td><td>TDE</td>",1,"2020-06-21 11:25:24",4RUNNER,"KZN185,RZN18#,VZN18#","1995.11 - 2002.11",1,"2020-06-21 11:25:24",4RUNNER
251,"2020-06-27 01:08:58",16321,,"INLET, WATER",,,16,"2020-06-26 13:13:18","RADIATOR & WATER OUTLET",1,"2020-06-22 11:25:44","Engine, fuel system",1,"2020-06-22 10:49:26","<td>KZN185L-GKMST</td><td>2000.08 - 2002.11</td><td>1KZTE</td><td>MTM</td><td>Left hand drive</td><td>TDE</td>",1,"2020-06-21 11:25:24",4RUNNER,"KZN185,RZN18#,VZN18#","1995.11 - 2002.11",1,"2020-06-21 11:25:24",4RUNNER
252,"2020-06-27 01:08:58",16285A,,"CLIP(FOR TURBO WATER HOSE NO.2)",,,16,"2020-06-26 13:13:18","RADIATOR & WATER OUTLET",1,"2020-06-22 11:25:44","Engine, fuel system",1,"2020-06-22 10:49:26","<td>KZN185L-GKMST</td><td>2000.08 - 2002.11</td><td>1KZTE</td><td>MTM</td><td>Left hand drive</td><td>TDE</td>",1,"2020-06-21 11:25:24",4RUNNER,"KZN185,RZN18#,VZN18#","1995.11 - 2002.11",1,"2020-06-21 11:25:24",4RUNNER
253,"2020-06-27 01:08:58",16381,,"BAR, FAN BELT ADJUSTING",,,16,"2020-06-26 13:13:18","RADIATOR & WATER OUTLET",1,"2020-06-22 11:25:44","Engine, fuel system",1,"2020-06-22 10:49:26","<td>KZN185L-GKMST</td><td>2000.08 - 2002.11</td><td>1KZTE</td><td>MTM</td><td>Left hand drive</td><td>TDE</td>",1,"2020-06-21 11:25:24",4RUNNER,"KZN185,RZN18#,VZN18#","1995.11 - 2002.11",1,"2020-06-21 11:25:24",4RUNNER
254,"2020-06-27 01:08:58",16347A,,"GASKET(FOR TURBO WATER PIPE)",,,16,"2020-06-26 13:13:18","RADIATOR & WATER OUTLET",1,"2020-06-22 11:25:44","Engine, fuel system",1,"2020-06-22 10:49:26","<td>KZN185L-GKMST</td><td>2000.08 - 2002.11</td><td>1KZTE</td><td>MTM</td><td>Left hand drive</td><td>TDE</td>",1,"2020-06-21 11:25:24",4RUNNER,"KZN185,RZN18#,VZN18#","1995.11 - 2002.11",1,"2020-06-21 11:25:24",4RUNNER
255,"2020-06-27 01:08:58",16346,,"GASKET, THERMOSTAT",,,16,"2020-06-26 13:13:18","RADIATOR & WATER OUTLET",1,"2020-06-22 11:25:44","Engine, fuel system",1,"2020-06-22 10:49:26","<td>KZN185L-GKMST</td><td>2000.08 - 2002.11</td><td>1KZTE</td><td>MTM</td><td>Left hand drive</td><td>TDE</td>",1,"2020-06-21 11:25:24",4RUNNER,"KZN185,RZN18#,VZN18#","1995.11 - 2002.11",1,"2020-06-21 11:25:24",4RUNNER
256,"2020-06-27 01:08:58",16572A,,"CLAMP OR CLIP, HOSE(FOR RADIATOR OUTLET NO.1)",,,16,"2020-06-26 13:13:18","RADIATOR & WATER OUTLET",1,"2020-06-22 11:25:44","Engine, fuel system",1,"2020-06-22 10:49:26","<td>KZN185L-GKMST</td><td>2000.08 - 2002.11</td><td>1KZTE</td><td>MTM</td><td>Left hand drive</td><td>TDE</td>",1,"2020-06-21 11:25:24",4RUNNER,"KZN185,RZN18#,VZN18#","1995.11 - 2002.11",1,"2020-06-21 11:25:24",4RUNNER
257,"2020-06-27 01:08:58",16385,,"SLIDER, FAN BELT ADJUSTING",,,16,"2020-06-26 13:13:18","RADIATOR & WATER OUTLET",1,"2020-06-22 11:25:44","Engine, fuel system",1,"2020-06-22 10:49:26","<td>KZN185L-GKMST</td><td>2000.08 - 2002.11</td><td>1KZTE</td><td>MTM</td><td>Left hand drive</td><td>TDE</td>",1,"2020-06-21 11:25:24",4RUNNER,"KZN185,RZN18#,VZN18#","1995.11 - 2002.11",1,"2020-06-21 11:25:24",4RUNNER
258,"2020-06-27 01:08:58",16286A,,"CLIP(FOR TURBO WATER HOSE NO.3)",,,16,"2020-06-26 13:13:18","RADIATOR & WATER OUTLET",1,"2020-06-22 11:25:44","Engine, fuel system",1,"2020-06-22 10:49:26","<td>KZN185L-GKMST</td><td>2000.08 - 2002.11</td><td>1KZTE</td><td>MTM</td><td>Left hand drive</td><td>TDE</td>",1,"2020-06-21 11:25:24",4RUNNER,"KZN185,RZN18#,VZN18#","1995.11 - 2002.11",1,"2020-06-21 11:25:24",4RUNNER
259,"2020-06-27 01:08:58",16572,,"HOSE, RADIATOR, OUTLET",,,16,"2020-06-26 13:13:18","RADIATOR & WATER OUTLET",1,"2020-06-22 11:25:44","Engine, fuel system",1,"2020-06-22 10:49:26","<td>KZN185L-GKMST</td><td>2000.08 - 2002.11</td><td>1KZTE</td><td>MTM</td><td>Left hand drive</td><td>TDE</td>",1,"2020-06-21 11:25:24",4RUNNER,"KZN185,RZN18#,VZN18#","1995.11 - 2002.11",1,"2020-06-21 11:25:24",4RUNNER